Georgy N Joseph

BUILD FAILED error while upgrading Clarity 8.1 to 12.1

Discussion created by Georgy N Joseph on Dec 17, 2010
Latest reply on Dec 20, 2010 by Chris_Hackett
[size=4]We are trying to upgrade our Clarity installation from 8.1 to 12.1.

Clarity 8.1
OS >>Red hat Linux 4

First we upgrade Linux 4 to Linux 5, by holding all installed applications (Clarity 8.1, Orcale 10.2.0.4.0, Java 2 SDK, Apache Tomcat 6.0.26 etc.) After upgrading the OS everything except Clarity NSA was working fine.

Then we tried to upgrade clarity 8.1 to 12.1. For that we installed ‘jdk1.6.0_20’, apache-tomcat 6.0.26.

BUT While trying to upgrade Clarity 8.1 to 12.1 we got ‘BUILD FAILED’ error. See the attached log here:


12/15/10 5:29 PM (ExecTask) Command: compile

12/15/10 5:29 PM (ExecTask) Compiling the database....

12/15/10 5:29 PM (ExecTask)

12/15/10 5:29 PM (ExecTask) Total time: 0H:0M:1S

12/15/10 5:29 PM (ExecTask) Applying rqp_instance_rights.xml

12/15/10 5:29 PM (ExecTask) Applying rqp_requirementpriority.xml

12/15/10 5:30 PM (ExecTask) Applying ReleaseDashboard.xml

12/15/10 5:30 PM (ExecTask) Applying ReleasePlanner.xml

12/15/10 5:30 PM (ExecTask) Applying rqrmnt_release_group.xml

12/15/10 5:30 PM (ExecTask) Applying inv_instance_rights.xml

12/15/10 5:30 PM (ExecTask) Applying BROWSE_WORKFLOW_RESOURCES.xml

12/15/10 5:30 PM (ExecTask) Applying IMM_BROWSE_RESOURCE.xml

12/15/10 5:30 PM (ExecTask) Applying RPT_BROWSE_ALL_RESOURCE.xml

12/15/10 5:30 PM (ExecTask) Applying SCH_BROWSE_RESOURCE_BY_CODE.xml

12/15/10 5:30 PM (ExecTask) Applying pma_instance_rights.xml

12/15/10 5:30 PM (ExecTask) Applying service_instance_rights.xml

12/15/10 5:30 PM (ExecTask) Content Pack clarityContent version 8.1.0.4247 has been deployed

12/15/10 5:30 PM (ExecTask) Installing content... clarityContent

12/15/10 5:30 PM (ExecTask) Installing content items that do not already exist or have the force option set to true

[color=#E30707]12/15/10 5:30 PM (ExecTask) - Node in Dependency document could not be found for code = projmgr.roleCapacity::portlet::portlets/projmgr_roleCapacity.xml[color]

12/15/10 5:30 PM (ExecTask) ERROR 2010-12-15 17:30:48,869 [main] niku.nsa Node in Dependency document could not be found for code = projmgr.roleCapacity::portlet::portlets/projmgr_roleCapacity.xml

12/15/10 5:30 PM (ExecTask) - Node in Dependency document could not be found for code = projmgr.OBSResourceAggregation::portlet::portlets/projmgr_obsResourceAggregation.xml

12/15/10 5:30 PM (ExecTask) ERROR 2010-12-15 17:30:48,900 [main] niku.nsa Node in Dependency document could not be found for code = projmgr.OBSResourceAggregation::portlet::portlets/projmgr_obsResourceAggregation.xml

12/15/10 5:30 PM (ExecTask) - Node in Dependency document could not be found for code = projmgr.OBSInvestmentAggregation::portlet::portlets/projmgr_obsInvestmentAggregation.xml

12/15/10 5:30 PM (ExecTask) ERROR 2010-12-15 17:30:48,904 [main] niku.nsa Node in Dependency document could not be found for code = projmgr.OBSInvestmentAggregation::portlet::portlets/projmgr_obsInvestmentAggregation.xml

12/15/10 5:30 PM (ExecTask) - Node in Dependency document could not be found for code = projmgr.resourcePlanning::page::pages/projmgr_resourcePlanning.xml

12/15/10 5:30 PM (ExecTask) ERROR 2010-12-15 17:30:48,907 [main] niku.nsa Node in Dependency document could not be found for code = projmgr.resourcePlanning::page::pages/projmgr_resourcePlanning.xml

12/15/10 5:30 PM (ExecTask) - Node in Dependency document could not be found for code = projmgr.workloads::menu::menus/application_projmgr_workloads.xml

12/15/10 5:30 PM (ExecTask) ERROR 2010-12-15 17:30:48,910 [main] niku.nsa Node in Dependency document could not be found for code = projmgr.workloads::menu::menus/application_projmgr_workloads.xml

12/15/10 5:30 PM (ExecTask) - Node in Dependency document could not be found for code = Financials::portlet::portlets/Financials.xml

12/15/10 5:30 PM (ExecTask) ERROR 2010-12-15 17:30:48,915 [main] niku.nsa Node in Dependency document could not be found for code = Financials::portlet::portlets/Financials.xml

12/15/10 5:30 PM (ExecTask) - Initializing: pma.init...

12/15/10 5:30 PM (ExecTask) SYS 2010-12-15 17:30:49,017 [main] niku.union Initializing: pma.init...

12/15/10 5:31 PM (ExecTask) - Could not save document xid_prt_portDash.swf exception com.niku.dms.util.DMSException: Could not create directory in file store.

[color=#E30707]12/15/10 5:31 PM (ExecTask) ERROR 2010-12-15 17:31:01,615 [main] xblhandlers.InteractivePortletXogHandler Could not save document xid_prt_portDash.swf exception com.niku.dms.util.DMSException: Could not create directory in file store.[color]

12/15/10 5:31 PM (ExecTask) Error occurred: /opt/clarity/.setup/scripts/db.xml:204: exec returned: 2

12/15/10 5:31 PM (ExecTask) Check admin.log or use -verbose for more information.

12/15/10 5:31 PM (UnknownElement) Task "exec" finished with error.

/opt/clarity12.1install/clarity/temp/install.xml:606: exec returned: 1

[color=#F00808][color]

Please help us.

Georgy[size]

Outcomes