AnsweredAssumed Answered

upgrade Failed with error V12.1.1 patch 10 to V14.1

Question asked by Suhas Kamble on Mar 18, 2015
Latest reply on Jun 5, 2015 by nick_darlington

Below is the error log

I looked at the other post https://communities.ca.com/message/241733887#241733887 but DB analyze did not give any results for me to decide a direction.

 

 

3/17/15 12:53 PM (Echo)  The results of the checkinstall utility:

3/17/15 12:53 PM (Echo)  There are 0 BYPASSED message(s).

3/17/15 12:53 PM (Echo)  There are 5 SKIPPED message(s).

3/17/15 12:53 PM (Echo)  There are 14 INFO message(s).

3/17/15 12:53 PM (Echo)  There are 5 WARNING message(s).

3/17/15 12:53 PM (Echo)  There are 0 INCOMPLETE message(s).

3/17/15 12:53 PM (Echo)  There are 0 ERROR message(s).

3/17/15 12:53 PM (TransformTask) Transforming: precheck-results.xml

3/17/15 12:53 PM (TransformTask) XSLT file: /480fs01/installs_backups/v14binaries/install/checkinstall/checkinstall-results.xsl

3/17/15 12:53 PM (TransformTask) Destination file: /480fs01/installs_backups/v14binaries/install/checkinstall/check-logs/precheck-results.html

3/17/15 12:53 PM (TransformTask) Processed 1 file(s) in 1 second(s)

3/17/15 12:53 PM (Echo) Checkinstall report has been created in: check-logs/precheck-results.html

3/17/15 12:53 PM (Target) Target "_checkinstall-report" finished.

3/17/15 12:53 PM (Target) Target "_package-reports" started.

3/17/15 12:53 PM (Target) Target "_package-reports" finished.

3/17/15 12:53 PM (Target) Target "_perform_check" finished.

3/17/15 12:53 PM (Target) Target "perform_upgrade_check" finished.

3/17/15 12:53 PM (Target) Target "checkinstall" finished.

3/17/15 12:53 PM (Echo)

3/17/15 12:53 PM (Echo)  -------------------------------------------------------------

3/17/15 12:53 PM (Echo)  The Precheck for install/upgrade results contain warning messages.

3/17/15 12:53 PM (Echo)  Please see the checkinstall/check-logs/precheck-results.html and

3/17/15 12:53 PM (Echo)  checkinstall.log files for information.

3/17/15 12:53 PM (Echo)  -------------------------------------------------------------

3/17/15 12:53 PM (ReadLine)

3/17/15 12:53 PM (ReadLine) Type 'y' to proceed :

3/17/15 12:54 PM (Target) Target "_precheck" finished.

3/17/15 12:54 PM (Target) Target "upgrade" started.

3/17/15 12:54 PM (Echo) Preserving customer specified files prior to upgrade from install.dir = /480fs01/clarity8

3/17/15 12:54 PM (Mkdir) Created dir: /480fs01/installs_backups/v14binaries/install/upgrade_temp

3/17/15 12:54 PM (Target) Target "upgrade" finished.

3/17/15 12:54 PM (Target) Target "_preprocess-upgrade" finished.

3/17/15 12:54 PM (CallTarget) Task "antcall" started.

3/17/15 12:54 PM (Project) Trying to override old definition of task java

3/17/15 12:54 PM (Target) Target "init" started.

3/17/15 12:54 PM (Target) Target "init" finished.

3/17/15 12:54 PM (Target) Target "_process-release" started.

3/17/15 12:54 PM (Project) Trying to override old definition of task java

3/17/15 12:54 PM (Target) Target "init" started.

3/17/15 12:54 PM (Target) Target "init" finished.

3/17/15 12:54 PM (Target) Target "_install-release" started.

3/17/15 12:54 PM (Jar) Updating jar: /480fs01/installs_backups/v14binaries/install/install-packages/13.0.0/upgrade-repack.13.0.0.7032tpexcludes/package.jar

3/17/15 12:55 PM (Project) Trying to override old definition of task java

3/17/15 12:55 PM (Target) Target "_version_prep" started.

3/17/15 12:55 PM (Copy) Copying 5 files to /480fs01/installs_backups/v14binaries/install/install-packages/13.0.0/upgrade-repack.13.0.0.7032tpexcludes/upgrade/13.0.0

3/17/15 12:55 PM (Copy) Copying 2 files to /480fs01/installs_backups/v14binaries/install/install-packages/13.0.0/upgrade-repack.13.0.0.7032tpexcludes

3/17/15 12:55 PM (MacroDef) Task "macrodef" started.

3/17/15 12:55 PM (MacroDef) Task "macrodef" finished.

3/17/15 12:55 PM (Target) Target "upgrade" started.

3/17/15 12:55 PM (Echo) Executing preexecute scripts

3/17/15 12:55 PM (Target) Target "upgrade" finished.

3/17/15 12:55 PM (Target) Target "_version_prep" finished.

3/17/15 12:55 PM (Echo)

3/17/15 12:55 PM (Echo) -------------------------------------------------------------

3/17/15 12:55 PM (Echo) Processing release: 13.0.0

3/17/15 12:55 PM (Echo) Package install path: /480fs01/installs_backups/v14binaries/install/install-packages/13.0.0/upgrade-repack.13.0.0.7032tpexcludes

3/17/15 12:55 PM (Echo) -------------------------------------------------------------

3/17/15 12:55 PM (Echo)

3/17/15 12:55 PM (Echo)

3/17/15 12:55 PM (Echo) -------------------------------------------------------------

3/17/15 12:55 PM (Echo) The following properties are used in the new install or upgrade invocation:

3/17/15 12:55 PM (Echo) force:              true

3/17/15 12:55 PM (Echo) force.install:      false

3/17/15 12:55 PM (Echo) interactive:        false

3/17/15 12:55 PM (Echo) skip.completed:      false

3/17/15 12:55 PM (Echo) appPoolId:       

3/17/15 12:55 PM (Echo) tenantId:            clarity

3/17/15 12:55 PM (Echo) qa.build:       

3/17/15 12:55 PM (Echo) qa.build.reimport:  false

3/17/15 12:55 PM (Echo) db.apply:            true

3/17/15 12:55 PM (Echo) xdm.apply:          true

3/17/15 12:55 PM (Echo) content.apply:      true

3/17/15 12:55 PM (Echo) legacy.upgrade:      false

3/17/15 12:55 PM (Echo) legacy.deploy:      false

3/17/15 12:55 PM (Echo) move.install.folder: true

3/17/15 12:55 PM (Echo) extract.package:    true

3/17/15 12:55 PM (Echo) reports.apply:      false

3/17/15 12:55 PM (Echo) install.target.dir:  /480fs01/clarity8

3/17/15 12:55 PM (Echo) install.dir          /480fs01/clarity8

3/17/15 12:55 PM (Echo) fail.on.errors:      true

3/17/15 12:55 PM (Echo) java_home:          /480fs01/java/jdk1.7.0_55

3/17/15 12:55 PM (Echo) j2ee.home:          /480fs01/tomcat7

3/17/15 12:55 PM (Echo) maintenance.release: false

3/17/15 12:55 PM (Echo) standalone:          true

3/17/15 12:55 PM (Echo) stop.at.dbinstall:  false

3/17/15 12:55 PM (Echo) -------------------------------------------------------------

3/17/15 12:55 PM (Echo)   

3/17/15 12:55 PM (Echo) java_home for 13.0.0 = /480fs01/java/jdk1.7.0_55

3/17/15 12:55 PM (Project) Trying to override old definition of task java

3/17/15 12:55 PM (Target) Target "init" started.

3/17/15 12:55 PM (Target) Target "init" finished.

3/17/15 12:55 PM (Target) Target "_stop-services" started.

3/17/15 12:55 PM (Project) Trying to override old definition of task java

3/17/15 12:55 PM (Target) Target "_stop-service" started.

3/17/15 12:55 PM (Echo) service id = beacon

3/17/15 12:55 PM (Echo)  servicecmd = niku

3/17/15 12:55 PM (ExecTask) Stopping Niku Beacon [beacon]...

3/17/15 12:55 PM (ExecTask) [-] Niku Beacon [beacon] is already stopped

3/17/15 12:55 PM (Target) Target "_stop-service" finished.

3/17/15 12:55 PM (Project) Trying to override old definition of task java

3/17/15 12:55 PM (Target) Target "_stop-service" started.

3/17/15 12:55 PM (Echo) service id = app

3/17/15 12:55 PM (Echo)  servicecmd = niku

3/17/15 12:55 PM (ExecTask) Stopping Niku Server [app]...

3/17/15 12:55 PM (ExecTask) [-] Niku Server [app] is already stopped

3/17/15 12:55 PM (Target) Target "_stop-service" finished.

3/17/15 12:55 PM (Project) Trying to override old definition of task java

3/17/15 12:55 PM (Target) Target "_stop-service" started.

3/17/15 12:55 PM (Echo) service id = nsa

3/17/15 12:55 PM (Echo)  servicecmd = niku

3/17/15 12:55 PM (ExecTask) Stopping Niku System Admin Server [nsa]...

3/17/15 12:55 PM (ExecTask) [-] Niku System Admin Server [nsa] is already stopped

3/17/15 12:55 PM (Target) Target "_stop-service" finished.

3/17/15 12:55 PM (Project) Trying to override old definition of task java

3/17/15 12:55 PM (Target) Target "_stop-service" started.

3/17/15 12:55 PM (Echo) service id = bg

3/17/15 12:55 PM (Echo)  servicecmd = niku

3/17/15 12:55 PM (ExecTask) Stopping Niku Background Server [bg]...

3/17/15 12:55 PM (ExecTask) [-] Niku Background Server [bg] is already stopped

3/17/15 12:55 PM (Target) Target "_stop-service" finished.

3/17/15 12:55 PM (Target) Target "_stop-services" finished.

3/17/15 12:55 PM (ExecTask) Buildfile: /480fs01/installs_backups/v14binaries/install/install-packages/13.0.0/upgrade-repack.13.0.0.7032tpexcludes/gateway.xml

3/17/15 12:55 PM (ExecTask)

3/17/15 12:55 PM (ExecTask) gateway:

3/17/15 12:55 PM (ExecTask) Trying to override old definition of task java

3/17/15 12:55 PM (ExecTask)

3/17/15 12:55 PM (ExecTask) init:

3/17/15 12:55 PM (ExecTask)

3/17/15 12:55 PM (ExecTask) install:

3/17/15 12:55 PM (ExecTask) -----------------------------------------

3/17/15 12:55 PM (ExecTask) You chose the following:

3/17/15 12:55 PM (ExecTask)

3/17/15 12:55 PM (ExecTask) install.dir = /480fs01/clarity8

3/17/15 12:55 PM (ExecTask) -----------------------------------------

3/17/15 12:55 PM (ExecTask) Trying to override old definition of task java

3/17/15 12:55 PM (ExecTask)

3/17/15 12:55 PM (ExecTask) _upgrade:

3/17/15 12:55 PM (ExecTask) Trying to override old definition of task java

3/17/15 12:55 PM (ExecTask)

3/17/15 12:55 PM (ExecTask) init:

3/17/15 12:55 PM (ExecTask)

3/17/15 12:55 PM (ExecTask) _install:

3/17/15 12:55 PM (ExecTask) -----------------------------------------

3/17/15 12:55 PM (ExecTask) You chose the following:

3/17/15 12:55 PM (ExecTask)

3/17/15 12:55 PM (ExecTask) java_home            = /480fs01/java/jdk1.7.0_55

3/17/15 12:55 PM (ExecTask) nsa.multicast.address = 230.0.1.1

3/17/15 12:55 PM (ExecTask) nsa.multicast.port    = 9180

3/17/15 12:55 PM (ExecTask) nsa.client.port      = 9680

3/17/15 12:55 PM (ExecTask) use.command.prefix    = no

3/17/15 12:55 PM (ExecTask) root.user            = niku

3/17/15 12:55 PM (ExecTask) j2ee.vendor          = tomcat

3/17/15 12:55 PM (ExecTask) nsa.install          = true

3/17/15 12:55 PM (ExecTask) j2ee.home            = /480fs01/tomcat7

3/17/15 12:55 PM (ExecTask) nsa.web.port          = 9080

3/17/15 12:55 PM (ExecTask) -----------------------------------------

3/17/15 12:55 PM (ExecTask) Trying to override old definition of task java

3/17/15 12:55 PM (ExecTask)

3/17/15 12:55 PM (ExecTask) init:

3/17/15 12:55 PM (ExecTask)

3/17/15 12:55 PM (ExecTask) preextract:

3/17/15 12:55 PM (ExecTask)

3/17/15 12:55 PM (ExecTask) preextract::osf --> start

3/17/15 12:55 PM (ExecTask)

3/17/15 12:55 PM (ExecTask) upgrade:

3/17/15 12:55 PM (ExecTask) Removing obsolete odf.jar file...

3/17/15 12:55 PM (ExecTask) Deleting: /480fs01/clarity8/lib/odf.jar

3/17/15 12:55 PM (ExecTask) preextract::osf --> 0.0 seconds

3/17/15 12:55 PM (ExecTask)

3/17/15 12:55 PM (ExecTask) preextract::xdm --> start

3/17/15 12:55 PM (ExecTask)

3/17/15 12:55 PM (ExecTask) upgrade:

3/17/15 12:55 PM (ExecTask) backing up xdm descriptor file...

3/17/15 12:55 PM (ExecTask) Copying 1 file to /480fs01/clarity8/META-INF/xdm/config

3/17/15 12:55 PM (ExecTask) preextract::xdm --> 0.0 seconds

3/17/15 12:55 PM (ExecTask)

3/17/15 12:55 PM (ExecTask) preextract::content --> start

3/17/15 12:55 PM (ExecTask)

3/17/15 12:55 PM (ExecTask) init:

3/17/15 12:55 PM (ExecTask)

3/17/15 12:55 PM (ExecTask) copyContentPacks:

3/17/15 12:55 PM (ExecTask) Copying 1 file to /480fs01/clarity8/META-INF/content/config

3/17/15 12:55 PM (ExecTask)

3/17/15 12:55 PM (ExecTask) copyContentDescriptor:

3/17/15 12:55 PM (ExecTask) Copying 1 file to /480fs01/clarity8/META-INF/content/config

3/17/15 12:55 PM (ExecTask)

3/17/15 12:55 PM (ExecTask) upgrade:

3/17/15 12:55 PM (ExecTask) preextract::content --> 0.0 seconds

3/17/15 12:55 PM (ExecTask)

3/17/15 12:55 PM (ExecTask) preextract::release-override.13.0.0 --> start

3/17/15 12:55 PM (ExecTask)

3/17/15 12:55 PM (ExecTask) upgrade:

3/17/15 12:55 PM (ExecTask)  Executing incremental release-override preextract scripts

3/17/15 12:55 PM (ExecTask) preextract::release-override.13.0.0 --> 0.0 seconds

3/17/15 12:55 PM (ExecTask) Trying to override old definition of task java

3/17/15 12:55 PM (ExecTask)

3/17/15 12:55 PM (ExecTask) _process-install-dir:

3/17/15 12:55 PM (ExecTask) Moving 51030 files to /480fs01/clarity8_prev

3/17/15 12:55 PM (ExecTask) Created dir: /480fs01/clarity8

3/17/15 12:55 PM (ExecTask) Expanding: /480fs01/installs_backups/v14binaries/install/install-packages/13.0.0/upgrade-repack.13.0.0.7032tpexcludes/package.jar into /480fs01/clarity8

3/17/15 12:55 PM (ExecTask) Skipping fileset for directory /480fs01/clarity8/database/backups. It is empty.

3/17/15 12:55 PM (ExecTask) Copying 16 files to /480fs01/clarity8

3/17/15 12:55 PM (ExecTask) Trying to override old definition of task java

3/17/15 12:55 PM (ExecTask)

3/17/15 12:55 PM (ExecTask) init:

3/17/15 12:55 PM (ExecTask)

3/17/15 12:55 PM (ExecTask) postextract:

3/17/15 12:55 PM (ExecTask)

3/17/15 12:55 PM (ExecTask) postextract::osf --> start

3/17/15 12:55 PM (ExecTask)

3/17/15 12:55 PM (ExecTask) upgrade:

3/17/15 12:55 PM (ExecTask) Created dir: /480fs01/clarity8/resource/previousRelease

3/17/15 12:55 PM (ExecTask) Copying 667 files to /480fs01/clarity8/resource/previousRelease

3/17/15 12:55 PM (ExecTask) postextract::osf --> 3.0 seconds

3/17/15 12:55 PM (ExecTask)

3/17/15 12:55 PM (ExecTask) postextract::xdm --> start

3/17/15 12:55 PM (ExecTask)

3/17/15 12:55 PM (ExecTask) upgrade:

3/17/15 12:55 PM (ExecTask) Restoring xdm ...

3/17/15 12:55 PM (ExecTask) Copying 1 file to /480fs01/clarity8/META-INF/xdm/config

3/17/15 12:55 PM (ExecTask) Created dir: /480fs01/clarity8/xdm-temp

3/17/15 12:55 PM (ExecTask) Copying 146 files to /480fs01/clarity8/xdm-temp

3/17/15 12:55 PM (ExecTask) Copied 15 empty directories to 3 empty directories under /480fs01/clarity8/xdm-temp

3/17/15 12:55 PM (ExecTask) Copying 315 files to /480fs01/clarity8

3/17/15 12:55 PM (ExecTask) Copied 33 empty directories to 3 empty directories under /480fs01/clarity8

3/17/15 12:55 PM (ExecTask) Copying 146 files to /480fs01/clarity8

3/17/15 12:55 PM (ExecTask) Deleting directory /480fs01/clarity8/xdm-temp

3/17/15 12:55 PM (ExecTask) postextract::xdm --> 2.0 seconds

3/17/15 12:55 PM (ExecTask)

3/17/15 12:55 PM (ExecTask) postextract::content --> start

3/17/15 12:55 PM (ExecTask)

3/17/15 12:55 PM (ExecTask) init:

3/17/15 12:55 PM (ExecTask)

3/17/15 12:55 PM (ExecTask) upgrade:

3/17/15 12:55 PM (ExecTask)  Executing Retrieval of content file artifacts from previous install version = 12.1.1.1208

3/17/15 12:55 PM (ExecTask)

3/17/15 12:55 PM (ExecTask) restore-from-prev:

3/17/15 12:55 PM (ExecTask) Created dir: /480fs01/clarity8/content-temp

3/17/15 12:55 PM (ExecTask) Copying 182 files to /480fs01/clarity8/content-temp

3/17/15 12:55 PM (ExecTask) Copied 29 empty directories to 1 empty directory under /480fs01/clarity8/content-temp

3/17/15 12:55 PM (ExecTask) Copying 187 files to /480fs01/clarity8

3/17/15 12:55 PM (ExecTask) Copied 29 empty directories to 3 empty directories under /480fs01/clarity8

3/17/15 12:55 PM (ExecTask) Copying 98 files to /480fs01/clarity8

3/17/15 12:55 PM (ExecTask) Deleting directory /480fs01/clarity8/content-temp

3/17/15 12:55 PM (ExecTask)

3/17/15 12:55 PM (ExecTask) restore_content_jars:

3/17/15 12:55 PM (ExecTask)

3/17/15 12:55 PM (ExecTask) _copy_addin_jar_prev:

3/17/15 12:55 PM (ExecTask)

3/17/15 12:55 PM (ExecTask) migrateContentComponent:

3/17/15 12:55 PM (ExecTask) JVM args ignored when same JVM is used.

3/17/15 12:55 PM (ExecTask) Working directory ignored when same JVM is used.

3/17/15 12:55 PM (ExecTask) Failed to initialize instrumentation: access denied ("javax.management.MBeanTrustPermission" "register")

3/17/15 12:55 PM (ExecTask) postextract::content --> 3.0 seconds

3/17/15 12:55 PM (ExecTask)

3/17/15 12:55 PM (ExecTask) postextract::upgrade --> start

3/17/15 12:55 PM (ExecTask)

3/17/15 12:55 PM (ExecTask) upgrade:

3/17/15 12:55 PM (ExecTask)

3/17/15 12:55 PM (ExecTask) upgrade:

3/17/15 12:55 PM (ExecTask)

3/17/15 12:55 PM (ExecTask) upgrade:

3/17/15 12:55 PM (ExecTask) Restoring Xcelsius...

3/17/15 12:55 PM (ExecTask) Created dir: /480fs01/clarity8/upgrade/temp

3/17/15 12:55 PM (ExecTask) Expanding: /480fs01/clarity8_prev/webroot/downloads/DesignFiles_for_StockXcelsiusDashboards.zip into /480fs01/clarity8/upgrade/temp

3/17/15 12:55 PM (ExecTask) Updating zip: /480fs01/clarity8/webroot/downloads/DesignFiles_for_StockXcelsiusDashboards.zip

3/17/15 12:55 PM (ExecTask) Deleting directory /480fs01/clarity8/upgrade/temp

3/17/15 12:55 PM (ExecTask) postextract::upgrade --> 0.0 seconds

3/17/15 12:55 PM (ExecTask)

3/17/15 12:55 PM (ExecTask) postextract::release-override.13.0.0 --> start

3/17/15 12:55 PM (ExecTask)

3/17/15 12:55 PM (ExecTask) upgrade:

3/17/15 12:55 PM (ExecTask)  Updating installation directory with release override files...

3/17/15 12:55 PM (ExecTask) Expanding: /480fs01/installs_backups/v14binaries/install/install-packages/13.0.0/upgrade-repack.13.0.0.7032tpexcludes/upgrade/13.0.0/release-override.jar into /480fs01/clarity8

3/17/15 12:55 PM (ExecTask) Copying 1 file to /480fs01/clarity8/.setup

3/17/15 12:55 PM (ExecTask) Copying 5 files to /480fs01/clarity8/upgrade/13.0.0/preupgrade

3/17/15 12:55 PM (ExecTask) Copying 8 files to /480fs01/clarity8/upgrade/13.0.0/postupgrade

3/17/15 12:55 PM (ExecTask)  Executing incremental release-override postextract scripts

3/17/15 12:55 PM (ExecTask) postextract::release-override.13.0.0 --> 0.0 seconds

3/17/15 12:55 PM (ExecTask) Copying 1 file to /480fs01/clarity8/bin

3/17/15 12:55 PM (ExecTask) Updated properties.xml

3/17/15 12:55 PM (ExecTask) Updated hosts.xml

3/17/15 12:55 PM (ExecTask) Trying to override old definition of task java

3/17/15 12:55 PM (ExecTask)

3/17/15 12:55 PM (ExecTask) init:

3/17/15 12:55 PM (ExecTask)

3/17/15 12:55 PM (ExecTask) preupgrade:

3/17/15 12:55 PM (ExecTask) Trying to override old definition of task java

3/17/15 12:55 PM (ExecTask)

3/17/15 12:55 PM (ExecTask) init:

3/17/15 12:55 PM (ExecTask)

3/17/15 12:55 PM (ExecTask) installsteps:

3/17/15 12:55 PM (ExecTask) init_upgrade - HeapSize Max = 2048m, PermGenSize Max = 256m

3/17/15 12:55 PM (ExecTask) ==========================================

3/17/15 12:55 PM (ExecTask) DBTools Log - Tue Mar 17 12:55:56 MDT 2015

3/17/15 12:55 PM (ExecTask) ==========================================

3/17/15 12:55 PM (ExecTask)

3/17/15 12:55 PM (ExecTask) Command: install database schema from driver file

3/17/15 12:55 PM (ExecTask) To URL: jdbc:clarity:oracle://10.78.188.95:58532;SID=cddbniku;BatchPerformanceWorkaround=true;InsensitiveResultSetBufferSize=0;ServerType=dedicated;supportLinks=true

3/17/15 12:55 PM (ExecTask) As user: niku

3/17/15 12:55 PM (ExecTask) For vendor: oracle

3/17/15 12:55 PM (ExecTask) Option: filtering on type "^function$"

3/17/15 12:55 PM (ExecTask) Option: -updateHistory=false - update history will not be recorded for this session.

3/17/15 12:55 PM (ExecTask) Loading DBDriver file: /480fs01/clarity8/upgrade/infrastructure/schema/driver.xml

3/17/15 12:55 PM (ExecTask) Loading DBDriver file: /480fs01/clarity8/upgrade/infrastructure/schema/driver.xml

3/17/15 12:55 PM (ExecTask) Exception in thread "main" com.niku.dbtools.DBUpdateException: com.ca.clarity.jdbc.oraclebase.ddc: [CA Clarity][Oracle JDBC Driver][Oracle]ORA-00955: name is already used by an existing object

3/17/15 12:55 PM (ExecTask)

3/17/15 12:55 PM (ExecTask) at com.niku.dbtools.Utilities.executeAndCommitSql(Utilities.java:2391)

3/17/15 12:55 PM (ExecTask) at com.niku.dbtools.DriverApp.createDBHistoryTable(DriverApp.java:1253)

3/17/15 12:55 PM (ExecTask) at com.niku.dbtools.DriverApp.installSchemaDriver(DriverApp.java:382)

3/17/15 12:55 PM (ExecTask) at com.niku.dbtools.Utilities.run(Utilities.java:1561)

3/17/15 12:55 PM (ExecTask) at com.niku.dbtools.Utilities.main(Utilities.

3/17/15 12:55 PM (ExecTask) Total time: 0H:0M:1S

3/17/15 12:55 PM (ExecTask) java:716)

3/17/15 12:55 PM (ExecTask) Caused by: com.ca.clarity.jdbc.oraclebase.ddc: [CA Clarity][Oracle JDBC Driver][Oracle]ORA-00955: name is already used by an existing object

3/17/15 12:55 PM (ExecTask)

3/17/15 12:55 PM (ExecTask) at com.ca.clarity.jdbc.oraclebase.ddej.j(Unknown Source)

3/17/15 12:55 PM (ExecTask) at com.ca.clarity.jdbc.oraclebase.ddej.a(Unknown Source)

3/17/15 12:55 PM (ExecTask) at com.ca.clarity.jdbc.oraclebase.ddej.executeBatch(Unknown Source)

3/17/15 12:55 PM (ExecTask) at sun.reflect.NativeMethodAccessorImpl.invoke0(Native Method)

3/17/15 12:55 PM (ExecTask) at sun.reflect.NativeMethodAccessorImpl.invoke(NativeMethodAccessorImpl.java:57)

3/17/15 12:55 PM (ExecTask) at sun.reflect.DelegatingMethodAccessorImpl.invoke(DelegatingMethodAccessorImpl.java:43)

3/17/15 12:55 PM (ExecTask) at java.lang.reflect.Method.invoke(Method.java:606)

3/17/15 12:55 PM (ExecTask) at org.logicalcobwebs.proxool.ProxyStatement.invoke(ProxyStatement.java:68)

3/17/15 12:55 PM (ExecTask) at org.logicalcobwebs.cglib.proxy.Proxy$ProxyImpl$$EnhancerByCGLIB$$8cd56893.executeBatch(<generated>)

3/17/15 12:55 PM (ExecTask) at com.niku.dbtools.Utilities.executeAndCommitSql(Utilities.java:2376)

3/17/15 12:55 PM (ExecTask) ... 4 more

3/17/15 12:55 PM (ExecTask) Error occurred: /480fs01/clarity8/.setup/scripts/db.xml:1544: The following error occurred while executing this line:

3/17/15 12:55 PM (ExecTask) /480fs01/clarity8/.setup/scripts/db.xml:1565: The following error occurred while executing this line:

3/17/15 12:55 PM (ExecTask) /480fs01/clarity8/.setup/scripts/db.xml:1939: The following error occurred while executing this line:

3/17/15 12:55 PM (ExecTask) /480fs01/clarity8/.setup/scripts/db.macros.xml:35: Java returned: 1

3/17/15 12:55 PM (ExecTask) Check admin.log or use -verbose for more information.

3/17/15 12:55 PM (ExecTask)

3/17/15 12:55 PM (ExecTask) BUILD FAILED

3/17/15 12:55 PM (ExecTask) /480fs01/installs_backups/v14binaries/install/install-packages/13.0.0/upgrade-repack.13.0.0.7032tpexcludes/gateway.xml:38: The following error occurred while executing this line:

3/17/15 12:55 PM (ExecTask) /480fs01/installs_backups/v14binaries/install/install-packages/13.0.0/upgrade-repack.13.0.0.7032tpexcludes/install.xml:186: The following error occurred while executing this line:

3/17/15 12:55 PM (ExecTask) /480fs01/installs_backups/v14binaries/install/install-packages/13.0.0/upgrade-repack.13.0.0.7032tpexcludes/install.xml:232: The following error occurred while executing this line:

3/17/15 12:55 PM (ExecTask) /480fs01/installs_backups/v14binaries/install/install-packages/13.0.0/upgrade-repack.13.0.0.7032tpexcludes/install.xml:688: The following error occurred while executing this line:

3/17/15 12:55 PM (ExecTask) /480fs01/installs_backups/v14binaries/install/install-packages/13.0.0/upgrade-repack.13.0.0.7032tpexcludes/install.xml:853: exec returned: 1

3/17/15 12:55 PM (ExecTask)

3/17/15 12:55 PM (ExecTask) Total time: 39 seconds

3/17/15 12:55 PM (Echo) release.exec.result = BUILD FAILED

3/17/15 12:55 PM (Echo) /480fs01/installs_backups/v14binaries/install/install-packages/13.0.0/upgrade-repack.13.0.0.7032tpexcludes/gateway.xml:38: The following error occurred while executing this line:

3/17/15 12:55 PM (Echo) /480fs01/installs_backups/v14binaries/install/install-packages/13.0.0/upgrade-repack.13.0.0.7032tpexcludes/install.xml:186: The following error occurred while executing this line:

3/17/15 12:55 PM (Echo) /480fs01/installs_backups/v14binaries/install/install-packages/13.0.0/upgrade-repack.13.0.0.7032tpexcludes/install.xml:232: The following error occurred while executing this line:

3/17/15 12:55 PM (Echo) /480fs01/installs_backups/v14binaries/install/install-packages/13.0.0/upgrade-repack.13.0.0.7032tpexcludes/install.xml:688: The following error occurred while executing this line:

3/17/15 12:55 PM (Echo) /480fs01/installs_backups/v14binaries/install/install-packages/13.0.0/upgrade-repack.13.0.0.7032tpexcludes/install.xml:853: exec returned: 1

3/17/15 12:55 PM (Echo)

3/17/15 12:55 PM (Echo) Total time: 39 seconds

3/17/15 12:55 PM (UnknownElement) Task "fail" finished with error.

/480fs01/installs_backups/v14binaries/install/install.xml:873: The upgrade step for 13.0.0 failed. Please consult the

                /480fs01/installs_backups/v14binaries/install/install-packages/13.0.0/upgrade-repack.13.0.0.7032tpexcludes/install.log for that release package."

  at org.apache.tools.ant.taskdefs.Exit.execute(Exit.java:164)

  at org.apache.tools.ant.UnknownElement.execute(UnknownElement.java:291)

  at sun.reflect.GeneratedMethodAccessor4.invoke(Unknown Source)

  at sun.reflect.DelegatingMethodAccessorImpl.invoke(DelegatingMethodAccessorImpl.java:43)

  at java.lang.reflect.Method.invoke(Method.java:606)

  at org.apache.tools.ant.dispatch.DispatchUtils.execute(DispatchUtils.java:106)

  at org.apache.tools.ant.Task.perform(Task.java:348)

  at com.niku.tools.taskdefs.IfTask.execute(IfTask.java:219)

  at org.apache.tools.ant.UnknownElement.execute(UnknownElement.java:291)

  at sun.reflect.GeneratedMethodAccessor4.invoke(Unknown Source)

  at sun.reflect.DelegatingMethodAccessorImpl.invoke(DelegatingMethodAccessorImpl.java:43)

  at java.lang.reflect.Method.invoke(Method.java:606)

  at org.apache.tools.ant.dispatch.DispatchUtils.execute(DispatchUtils.java:106)

  at org.apache.tools.ant.Task.perform(Task.java:348)

  at com.niku.tools.taskdefs.IfTask.execute(IfTask.java:219)

  at org.apache.tools.ant.UnknownElement.execute(UnknownElement.java:291)

  at sun.reflect.GeneratedMethodAccessor4.invoke(Unknown Source)

  at sun.reflect.DelegatingMethodAccessorImpl.invoke(DelegatingMethodAccessorImpl.java:43)

  at java.lang.reflect.Method.invoke(Method.java:606)

  at org.apache.tools.ant.dispatch.DispatchUtils.execute(DispatchUtils.java:106)

  at org.apache.tools.ant.Task.perform(Task.java:348)

  at org.apache.tools.ant.taskdefs.Sequential.execute(Sequential.java:68)

  at sun.reflect.GeneratedMethodAccessor19.invoke(Unknown Source)

  at sun.reflect.DelegatingMethodAccessorImpl.invoke(DelegatingMethodAccessorImpl.java:43)

  at java.lang.reflect.Method.invoke(Method.java:606)

  at org.apache.tools.ant.dispatch.DispatchUtils.execute(DispatchUtils.java:106)

  at org.apache.tools.ant.Task.perform(Task.java:348)

  a

 

Message was edited by: Suhas Kamble Attached the checkinstall custom tables list just in case required. I cleared all other warnings shown by checkinstall before starting the upgrade.

Outcomes