AnsweredAssumed Answered

PMO Accelerator Clarity version 12.1 in DEV

Question asked by Slovak on Mar 29, 2012
Latest reply on May 18, 2012 by Slovak
All

We are attempting to install the PMO Accelerator into v12.1.

We have ran into some issues. I have already looked at the blogs regarding this issue and we did follow someone's suggestion and it still failed.

Here is where we are right now.

The Value required is unchecked for attributes

The resource id csk.admin has every possible right a resource can have so this cannot be the issue.

It appears that based on the blog suggestion our output should produce 2 files:

XXXXX.COTS_2_.xml

Here is the logg file that the recent attempt.

[echo]
-------------------------------------------------------------
This program will install package csk:

See the included README.txt for more information.
-------------------------------------------------------------


_install:
[echo]

init:

install:
[echo]
-------------------------------------------------------------
This program will install the PMO Accelerator

Version: 2.2.0

Warning:

* The PMO Accelerator cannot
be automatically uninstalled.

* The PMO Accelerator sample data,
which can be installed separately,
is intended for demonstration
purposes only and should not be
installed to a production server.
There is no mechanism for
uninstalling the sample data.

* This PMO Accelerator
update must be applied against
Clarity version 12.1.0 or higher.

* Review the Read Me file prior to installation.
-------------------------------------------------------------

[echo]

init:

files:
[copy] Copying 697 files to D:\niku\clarity

pack-config:

remove-attribute:
[echo] Removing obj_alignment attribute...
[java] Attribute with the given specifications {ext_type=formula, attribute=obj_alignment, object=inv, type=number} not found. No removal necessary.

protect-view:
[echo] Getting view information...
[java] Starting view protection
[java] Completed view protection

deploy:
[exec] Content Pack csk version 8.1.0.4247 has been deployed
[exec] Installing content... csk
[exec] Installing content items that do not already exist or have the force option set to true
[exec] ==========================================
[exec] DBTools Log - Tue Mar 27 12:59:38 CDT 2012
[exec] ==========================================
[exec]
[exec] Command: install database schema from driver file
[exec] To URL: jdbc:clarity:sqlserver://ndcmsqld03:1433;DatabaseName=niku;InsensitiveResultSetBufferSize=0;ProgramName=Clarity
[exec] As user: Niku
[exec] For vendor: mssql
[exec] Loading DBDriver file: d:\NIKU\Clarity\database\content\csk\preupgrade-driver.xml
[exec] Loading DBDriver file: d:\NIKU\Clarity\database\content\csk\preupgrade-driver.xml
[exec] Current database version is database_csk_2.2.0.0006-preupgrade
[exec] DBDriver for database_csk_2.2.0.0007-preupgrade
[exec] Start installation of DBDriver ...
[exec]
[exec] Note: Foreign Keys have been disabled
[exec] Process - pre-upgrade: PMO_616.xml
[exec] Note: Foreign Keys and Triggers have been enabled
[exec]
[exec] DBDriver successfully installed!
[exec]
[exec] Total time: 0H:0M:2S
[exec] - Initializing: pma.init...
[exec] SYS 2012-03-27 12:59:41,458 [main] niku.union Initializing: pma.init...

BUILD FAILED

D:\NIKU\Install\PMO_2.2\install.xml:58: The following error occurred while executing this line:
D:\NIKU\Install\PMO_2.2\install.xml:73: The following error occurred while executing this line:
D:\NIKU\Install\PMO_2.2\package\install.xml:135: The following error occurred while executing this line:
D:\NIKU\Install\PMO_2.2\package\install.xml:271: exec returned: 2

at org.apache.tools.ant.ProjectHelper.addLocationToBuildException(ProjectHelper.java:539)

at org.apache.tools.ant.taskdefs.Ant.execute(Ant.java:384)

at org.apache.tools.ant.taskdefs.CallTarget.execute(CallTarget.java:107)

at com.niku.tools.taskdefs.IfTask.execute(IfTask.java:209)

at org.apache.tools.ant.Task.perform(Task.java:364)

at com.niku.tools.taskdefs.ChooseTask.execute(ChooseTask.java:132)

at org.apache.tools.ant.UnknownElement.execute(UnknownElement.java:275)

at org.apache.tools.ant.Task.perform(Task.java:364)

at com.niku.tools.taskdefs.IfTask.execute(IfTask.java:204)

at org.apache.tools.ant.Task.perform(Task.java:364)

at com.niku.tools.taskdefs.ChooseTask.execute(ChooseTask.java:132)

at org.apache.tools.ant.UnknownElement.execute(UnknownElement.java:275)

at org.apache.tools.ant.Task.perform(Task.java:364)

at org.apache.tools.ant.Target.execute(Target.java:342)

at org.apache.tools.ant.Target.performTasks(Target.java:370)

at org.apache.tools.ant.Project.executeSortedTargets(Project.java:1216)

at org.apache.tools.ant.Project.executeTarget(Project.java:1185)

at org.apache.tools.ant.helper.DefaultExecutor.executeTargets(DefaultExecutor.java:40)

at org.apache.tools.ant.Project.executeTargets(Project.java:1068)

at org.apache.tools.ant.Main.runBuild(Main.java:675)

at org.apache.tools.ant.Main.startAnt(Main.java:190)

at org.apache.tools.ant.launch.Launcher.run(Launcher.java:246)

at org.apache.tools.ant.launch.Launcher.main(Launcher.java:67)
Caused by: D:\NIKU\Install\PMO_2.2\install.xml:73: The following error occurred while executing this line:
D:\NIKU\Install\PMO_2.2\package\install.xml:135: The following error occurred while executing this line:
D:\NIKU\Install\PMO_2.2\package\install.xml:271: exec returned: 2

at org.apache.tools.ant.ProjectHelper.addLocationToBuildException(ProjectHelper.java:539)

at org.apache.tools.ant.taskdefs.Ant.execute(Ant.java:384)

at org.apache.tools.ant.UnknownElement.execute(UnknownElement.java:275)

at org.apache.tools.ant.Task.perform(Task.java:364)

at org.apache.tools.ant.Target.execute(Target.java:342)

at org.apache.tools.ant.Target.performTasks(Target.java:370)

at org.apache.tools.ant.Project.executeSortedTargets(Project.java:1216)

at org.apache.tools.ant.helper.SingleCheckExecutor.executeTargets(SingleCheckExecutor.java:37)

at org.apache.tools.ant.Project.executeTargets(Project.java:1068)

at org.apache.tools.ant.taskdefs.Ant.execute(Ant.java:382)

... 21 more
Caused by: D:\NIKU\Install\PMO_2.2\package\install.xml:135: The following error occurred while executing this line:
D:\NIKU\Install\PMO_2.2\package\install.xml:271: exec returned: 2

at org.apache.tools.ant.ProjectHelper.addLocationToBuildException(ProjectHelper.java:539)

at org.apache.tools.ant.taskdefs.Ant.execute(Ant.java:384)

at org.apache.tools.ant.taskdefs.CallTarget.execute(CallTarget.java:107)

at com.niku.tools.taskdefs.IfTask.execute(IfTask.java:209)

at org.apache.tools.ant.Task.perform(Task.java:364)

at com.niku.tools.taskdefs.ChooseTask.execute(ChooseTask.java:132)

at org.apache.tools.ant.UnknownElement.execute(UnknownElement.java:275)

at org.apache.tools.ant.Task.perform(Task.java:364)

at org.apache.tools.ant.Target.execute(Target.java:342)

at org.apache.tools.ant.Target.performTasks(Target.java:370)

at org.apache.tools.ant.Project.executeSortedTargets(Project.java:1216)

at org.apache.tools.ant.helper.SingleCheckExecutor.executeTargets(SingleCheckExecutor.java:37)

at org.apache.tools.ant.Project.executeTargets(Project.java:1068)

at org.apache.tools.ant.taskdefs.Ant.execute(Ant.java:382)

... 29 more
Caused by: D:\NIKU\Install\PMO_2.2\package\install.xml:271: exec returned: 2

at org.apache.tools.ant.taskdefs.ExecTask.runExecute(ExecTask.java:591)

at org.apache.tools.ant.taskdefs.ExecTask.runExec(ExecTask.java:617)

at org.apache.tools.ant.taskdefs.ExecTask.execute(ExecTask.java:452)

at org.apache.tools.ant.UnknownElement.execute(UnknownElement.java:275)

at org.apache.tools.ant.Task.perform(Task.java:364)

at org.apache.tools.ant.Target.execute(Target.java:342)

at org.apache.tools.ant.Target.performTasks(Target.java:370)

at org.apache.tools.ant.Project.executeSortedTargets(Project.java:1216)

at org.apache.tools.ant.helper.SingleCheckExecutor.executeTargets(SingleCheckExecutor.java:37)

at org.apache.tools.ant.Project.executeTargets(Project.java:1068)

at org.apache.tools.ant.taskdefs.Ant.execute(Ant.java:382)

... 41 more
--- Nested Exception ---
D:\NIKU\Install\PMO_2.2\install.xml:73: The following error occurred while executing this line:
D:\NIKU\Install\PMO_2.2\package\install.xml:135: The following error occurred while executing this line:
D:\NIKU\Install\PMO_2.2\package\install.xml:271: exec returned: 2

at org.apache.tools.ant.ProjectHelper.addLocationToBuildException(ProjectHelper.java:539)

at org.apache.tools.ant.taskdefs.Ant.execute(Ant.java:384)

at org.apache.tools.ant.UnknownElement.execute(UnknownElement.java:275)

at org.apache.tools.ant.Task.perform(Task.java:364)

at org.apache.tools.ant.Target.execute(Target.java:342)

at org.apache.tools.ant.Target.performTasks(Target.java:370)

at org.apache.tools.ant.Project.executeSortedTargets(Project.java:1216)

at org.apache.tools.ant.helper.SingleCheckExecutor.executeTargets(SingleCheckExecutor.java:37)

at org.apache.tools.ant.Project.executeTargets(Project.java:1068)

at org.apache.tools.ant.taskdefs.Ant.execute(Ant.java:382)

at org.apache.tools.ant.taskdefs.CallTarget.execute(CallTarget.java:107)

at com.niku.tools.taskdefs.IfTask.execute(IfTask.java:209)

at org.apache.tools.ant.Task.perform(Task.java:364)

at com.niku.tools.taskdefs.ChooseTask.execute(ChooseTask.java:132)

at org.apache.tools.ant.UnknownElement.execute(UnknownElement.java:275)

at org.apache.tools.ant.Task.perform(Task.java:364)

at com.niku.tools.taskdefs.IfTask.execute(IfTask.java:204)

at org.apache.tools.ant.Task.perform(Task.java:364)

at com.niku.tools.taskdefs.ChooseTask.execute(ChooseTask.java:132)

at org.apache.tools.ant.UnknownElement.execute(UnknownElement.java:275)

at org.apache.tools.ant.Task.perform(Task.java:364)

at org.apache.tools.ant.Target.execute(Target.java:342)

at org.apache.tools.ant.Target.performTasks(Target.java:370)

at org.apache.tools.ant.Project.executeSortedTargets(Project.java:1216)

at org.apache.tools.ant.Project.executeTarget(Project.java:1185)

at org.apache.tools.ant.helper.DefaultExecutor.executeTargets(DefaultExecutor.java:40)

at org.apache.tools.ant.Project.executeTargets(Project.java:1068)

at org.apache.tools.ant.Main.runBuild(Main.java:675)

at org.apache.tools.ant.Main.startAnt(Main.java:190)

at org.apache.tools.ant.launch.Launcher.run(Launcher.java:246)

at org.apache.tools.ant.launch.Launcher.main(Launcher.java:67)
Caused by: D:\NIKU\Install\PMO_2.2\package\install.xml:135: The following error occurred while executing this line:
D:\NIKU\Install\PMO_2.2\package\install.xml:271: exec returned: 2

at org.apache.tools.ant.ProjectHelper.addLocationToBuildException(ProjectHelper.java:539)

at org.apache.tools.ant.taskdefs.Ant.execute(Ant.java:384)

at org.apache.tools.ant.taskdefs.CallTarget.execute(CallTarget.java:107)

at com.niku.tools.taskdefs.IfTask.execute(IfTask.java:209)

at org.apache.tools.ant.Task.perform(Task.java:364)

at com.niku.tools.taskdefs.ChooseTask.execute(ChooseTask.java:132)

at org.apache.tools.ant.UnknownElement.execute(UnknownElement.java:275)

at org.apache.tools.ant.Task.perform(Task.java:364)

at org.apache.tools.ant.Target.execute(Target.java:342)

at org.apache.tools.ant.Target.performTasks(Target.java:370)

at org.apache.tools.ant.Project.executeSortedTargets(Project.java:1216)

at org.apache.tools.ant.helper.SingleCheckExecutor.executeTargets(SingleCheckExecutor.java:37)

at org.apache.tools.ant.Project.executeTargets(Project.java:1068)

at org.apache.tools.ant.taskdefs.Ant.execute(Ant.java:382)

... 29 more
Caused by: D:\NIKU\Install\PMO_2.2\package\install.xml:271: exec returned: 2

at org.apache.tools.ant.taskdefs.ExecTask.runExecute(ExecTask.java:591)

at org.apache.tools.ant.taskdefs.ExecTask.runExec(ExecTask.java:617)

at org.apache.tools.ant.taskdefs.ExecTask.execute(ExecTask.java:452)

at org.apache.tools.ant.UnknownElement.execute(UnknownElement.java:275)

at org.apache.tools.ant.Task.perform(Task.java:364)

at org.apache.tools.ant.Target.execute(Target.java:342)

at org.apache.tools.ant.Target.performTasks(Target.java:370)

at org.apache.tools.ant.Project.executeSortedTargets(Project.java:1216)

at org.apache.tools.ant.helper.SingleCheckExecutor.executeTargets(SingleCheckExecutor.java:37)

at org.apache.tools.ant.Project.executeTargets(Project.java:1068)

at org.apache.tools.ant.taskdefs.Ant.execute(Ant.java:382)

... 41 more
--- Nested Exception ---
D:\NIKU\Install\PMO_2.2\package\install.xml:135: The following error occurred while executing this line:
D:\NIKU\Install\PMO_2.2\package\install.xml:271: exec returned: 2

at org.apache.tools.ant.ProjectHelper.addLocationToBuildException(ProjectHelper.java:539)

at org.apache.tools.ant.taskdefs.Ant.execute(Ant.java:384)

at org.apache.tools.ant.taskdefs.CallTarget.execute(CallTarget.java:107)

at com.niku.tools.taskdefs.IfTask.execute(IfTask.java:209)

at org.apache.tools.ant.Task.perform(Task.java:364)

at com.niku.tools.taskdefs.ChooseTask.execute(ChooseTask.java:132)

at org.apache.tools.ant.UnknownElement.execute(UnknownElement.java:275)

at org.apache.tools.ant.Task.perform(Task.java:364)

at org.apache.tools.ant.Target.execute(Target.java:342)

at org.apache.tools.ant.Target.performTasks(Target.java:370)

at org.apache.tools.ant.Project.executeSortedTargets(Project.java:1216)

at org.apache.tools.ant.helper.SingleCheckExecutor.executeTargets(SingleCheckExecutor.java:37)

at org.apache.tools.ant.Project.executeTargets(Project.java:1068)

at org.apache.tools.ant.taskdefs.Ant.execute(Ant.java:382)

at org.apache.tools.ant.UnknownElement.execute(UnknownElement.java:275)

at org.apache.tools.ant.Task.perform(Task.java:364)

at org.apache.tools.ant.Target.execute(Target.java:342)

at org.apache.tools.ant.Target.performTasks(Target.java:370)

at org.apache.tools.ant.Project.executeSortedTargets(Project.java:1216)

at org.apache.tools.ant.helper.SingleCheckExecutor.executeTargets(SingleCheckExecutor.java:37)

at org.apache.tools.ant.Project.executeTargets(Project.java:1068)

at org.apache.tools.ant.taskdefs.Ant.execute(Ant.java:382)

at org.apache.tools.ant.taskdefs.CallTarget.execute(CallTarget.java:107)

at com.niku.tools.taskdefs.IfTask.execute(IfTask.java:209)

at org.apache.tools.ant.Task.perform(Task.java:364)

at com.niku.tools.taskdefs.ChooseTask.execute(ChooseTask.java:132)

at org.apache.tools.ant.UnknownElement.execute(UnknownElement.java:275)

at org.apache.tools.ant.Task.perform(Task.java:364)

at com.niku.tools.taskdefs.IfTask.execute(IfTask.java:204)

at org.apache.tools.ant.Task.perform(Task.java:364)

at com.niku.tools.taskdefs.ChooseTask.execute(ChooseTask.java:132)

at org.apache.tools.ant.UnknownElement.execute(UnknownElement.java:275)

at org.apache.tools.ant.Task.perform(Task.java:364)

at org.apache.tools.ant.Target.execute(Target.java:342)

at org.apache.tools.ant.Target.performTasks(Target.java:370)

at org.apache.tools.ant.Project.executeSortedTargets(Project.java:1216)

at org.apache.tools.ant.Project.executeTarget(Project.java:1185)

at org.apache.tools.ant.helper.DefaultExecutor.executeTargets(DefaultExecutor.java:40)

at org.apache.tools.ant.Project.executeTargets(Project.java:1068)

at org.apache.tools.ant.Main.runBuild(Main.java:675)

at org.apache.tools.ant.Main.startAnt(Main.java:190)

at org.apache.tools.ant.launch.Launcher.run(Launcher.java:246)

at org.apache.tools.ant.launch.Launcher.main(Launcher.java:67)
Caused by: D:\NIKU\Install\PMO_2.2\package\install.xml:271: exec returned: 2

at org.apache.tools.ant.taskdefs.ExecTask.runExecute(ExecTask.java:591)

at org.apache.tools.ant.taskdefs.ExecTask.runExec(ExecTask.java:617)

at org.apache.tools.ant.taskdefs.ExecTask.execute(ExecTask.java:452)

at org.apache.tools.ant.UnknownElement.execute(UnknownElement.java:275)

at org.apache.tools.ant.Task.perform(Task.java:364)

at org.apache.tools.ant.Target.execute(Target.java:342)

at org.apache.tools.ant.Target.performTasks(Target.java:370)

at org.apache.tools.ant.Project.executeSortedTargets(Project.java:1216)

at org.apache.tools.ant.helper.SingleCheckExecutor.executeTargets(SingleCheckExecutor.java:37)

at org.apache.tools.ant.Project.executeTargets(Project.java:1068)

at org.apache.tools.ant.taskdefs.Ant.execute(Ant.java:382)

... 41 more
--- Nested Exception ---
D:\NIKU\Install\PMO_2.2\package\install.xml:271: exec returned: 2

at org.apache.tools.ant.taskdefs.ExecTask.runExecute(ExecTask.java:591)

at org.apache.tools.ant.taskdefs.ExecTask.runExec(ExecTask.java:617)

at org.apache.tools.ant.taskdefs.ExecTask.execute(ExecTask.java:452)

at org.apache.tools.ant.UnknownElement.execute(UnknownElement.java:275)

at org.apache.tools.ant.Task.perform(Task.java:364)

at org.apache.tools.ant.Target.execute(Target.java:342)

at org.apache.tools.ant.Target.performTasks(Target.java:370)

at org.apache.tools.ant.Project.executeSortedTargets(Project.java:1216)

at org.apache.tools.ant.helper.SingleCheckExecutor.executeTargets(SingleCheckExecutor.java:37)

at org.apache.tools.ant.Project.executeTargets(Project.java:1068)

at org.apache.tools.ant.taskdefs.Ant.execute(Ant.java:382)

at org.apache.tools.ant.taskdefs.CallTarget.execute(CallTarget.java:107)

at com.niku.tools.taskdefs.IfTask.execute(IfTask.java:209)

at org.apache.tools.ant.Task.perform(Task.java:364)

at com.niku.tools.taskdefs.ChooseTask.execute(ChooseTask.java:132)

at org.apache.tools.ant.UnknownElement.execute(UnknownElement.java:275)

at org.apache.tools.ant.Task.perform(Task.java:364)

at org.apache.tools.ant.Target.execute(Target.java:342)

at org.apache.tools.ant.Target.performTasks(Target.java:370)

at org.apache.tools.ant.Project.executeSortedTargets(Project.java:1216)

at org.apache.tools.ant.helper.SingleCheckExecutor.executeTargets(SingleCheckExecutor.java:37)

at org.apache.tools.ant.Project.executeTargets(Project.java:1068)

at org.apache.tools.ant.taskdefs.Ant.execute(Ant.java:382)

at org.apache.tools.ant.UnknownElement.execute(UnknownElement.java:275)

at org.apache.tools.ant.Task.perform(Task.java:364)

at org.apache.tools.ant.Target.execute(Target.java:342)

at org.apache.tools.ant.Target.performTasks(Target.java:370)

at org.apache.tools.ant.Project.executeSortedTargets(Project.java:1216)

at org.apache.tools.ant.helper.SingleCheckExecutor.executeTargets(SingleCheckExecutor.java:37)

at org.apache.tools.ant.Project.executeTargets(Project.java:1068)

at org.apache.tools.ant.taskdefs.Ant.execute(Ant.java:382)

at org.apache.tools.ant.taskdefs.CallTarget.execute(CallTarget.java:107)

at com.niku.tools.taskdefs.IfTask.execute(IfTask.java:209)

at org.apache.tools.ant.Task.perform(Task.java:364)

at com.niku.tools.taskdefs.ChooseTask.execute(ChooseTask.java:132)

at org.apache.tools.ant.UnknownElement.execute(UnknownElement.java:275)

at org.apache.tools.ant.Task.perform(Task.java:364)

at com.niku.tools.taskdefs.IfTask.execute(IfTask.java:204)

at org.apache.tools.ant.Task.perform(Task.java:364)

at com.niku.tools.taskdefs.ChooseTask.execute(ChooseTask.java:132)

at org.apache.tools.ant.UnknownElement.execute(UnknownElement.java:275)

at org.apache.tools.ant.Task.perform(Task.java:364)

at org.apache.tools.ant.Target.execute(Target.java:342)

at org.apache.tools.ant.Target.performTasks(Target.java:370)

at org.apache.tools.ant.Project.executeSortedTargets(Project.java:1216)

at org.apache.tools.ant.Project.executeTarget(Project.java:1185)

at org.apache.tools.ant.helper.DefaultExecutor.executeTargets(DefaultExecutor.java:40)

at org.apache.tools.ant.Project.executeTargets(Project.java:1068)

at org.apache.tools.ant.Main.runBuild(Main.java:675)

at org.apache.tools.ant.Main.startAnt(Main.java:190)

at org.apache.tools.ant.launch.Launcher.run(Launcher.java:246)

at org.apache.tools.ant.launch.Launcher.main(Launcher.java:67)
[echo]
-------------------------------------------------------------
This program will install package csk:

See the included README.txt for more information.
-------------------------------------------------------------


_install:
[echo]

init:

install:
[echo]
-------------------------------------------------------------
This program will install the PMO Accelerator

Version: 2.2.0

Warning:

* The PMO Accelerator cannot
be automatically uninstalled.

* The PMO Accelerator sample data,
which can be installed separately,
is intended for demonstration
purposes only and should not be
installed to a production server.
There is no mechanism for
uninstalling the sample data.

* This PMO Accelerator
update must be applied against
Clarity version 12.1.0 or higher.

* Review the Read Me file prior to installation.
-------------------------------------------------------------

[echo]

init:

files:

pack-config:

remove-attribute:
[echo] Removing obj_alignment attribute...
[java] Attribute with the given specifications {ext_type=formula, attribute=obj_alignment, object=inv, type=number} not found. No removal necessary.

protect-view:
[echo] Getting view information...
[java] Starting view protection
[java] Completed view protection

deploy:
[exec] Content Pack csk version 8.1.0.4247 has been deployed
[exec] Installing content... csk
[exec] Installing content items that do not already exist or have the force option set to true
[exec] ==========================================
[exec] DBTools Log - Tue Mar 27 13:09:10 CDT 2012
[exec] ==========================================
[exec]
[exec] Command: install database schema from driver file
[exec] To URL: jdbc:clarity:sqlserver://ndcmsqld03:1433;DatabaseName=niku;InsensitiveResultSetBufferSize=0;ProgramName=Clarity
[exec] As user: Niku
[exec] For vendor: mssql
[exec] Loading DBDriver file: d:\NIKU\Clarity\database\content\csk\preupgrade-driver.xml
[exec] Loading DBDriver file: d:\NIKU\Clarity\database\content\csk\preupgrade-driver.xml
[exec] Current database version is database_csk_2.2.0.0007-preupgrade
[exec] DBDriver for database_csk_2.2.0.0007-preupgrade
[exec] DBDriver has already been installed!
[exec]
[exec] Total time: 0H:0M:1S
[exec] - Initializing: pma.init...
[exec] SYS 2012-03-27 13:09:12,012 [main] niku.union Initializing: pma.init...

BUILD FAILED

D:\NIKU\Install\PMO_2.2\install.xml:58: The following error occurred while executing this line:
D:\NIKU\Install\PMO_2.2\install.xml:73: The following error occurred while executing this line:
D:\NIKU\Install\PMO_2.2\package\install.xml:135: The following error occurred while executing this line:
D:\NIKU\Install\PMO_2.2\package\install.xml:271: exec returned: 2

at org.apache.tools.ant.ProjectHelper.addLocationToBuildException(ProjectHelper.java:539)

at org.apache.tools.ant.taskdefs.Ant.execute(Ant.java:384)

at org.apache.tools.ant.taskdefs.CallTarget.execute(CallTarget.java:107)

at com.niku.tools.taskdefs.IfTask.execute(IfTask.java:209)

at org.apache.tools.ant.Task.perform(Task.java:364)

at com.niku.tools.taskdefs.ChooseTask.execute(ChooseTask.java:132)

at org.apache.tools.ant.UnknownElement.execute(UnknownElement.java:275)

at org.apache.tools.ant.Task.perform(Task.java:364)

at com.niku.tools.taskdefs.IfTask.execute(IfTask.java:204)

at org.apache.tools.ant.Task.perform(Task.java:364)

at com.niku.tools.taskdefs.ChooseTask.execute(ChooseTask.java:132)

at org.apache.tools.ant.UnknownElement.execute(UnknownElement.java:275)

at org.apache.tools.ant.Task.perform(Task.java:364)

at org.apache.tools.ant.Target.execute(Target.java:342)

at org.apache.tools.ant.Target.performTasks(Target.java:370)

at org.apache.tools.ant.Project.executeSortedTargets(Project.java:1216)

at org.apache.tools.ant.Project.executeTarget(Project.java:1185)

at org.apache.tools.ant.helper.DefaultExecutor.executeTargets(DefaultExecutor.java:40)

at org.apache.tools.ant.Project.executeTargets(Project.java:1068)

at org.apache.tools.ant.Main.runBuild(Main.java:675)

at org.apache.tools.ant.Main.startAnt(Main.java:190)

at org.apache.tools.ant.launch.Launcher.run(Launcher.java:246)

at org.apache.tools.ant.launch.Launcher.main(Launcher.java:67)
Caused by: D:\NIKU\Install\PMO_2.2\install.xml:73: The following error occurred while executing this line:
D:\NIKU\Install\PMO_2.2\package\install.xml:135: The following error occurred while executing this line:
D:\NIKU\Install\PMO_2.2\package\install.xml:271: exec returned: 2

at org.apache.tools.ant.ProjectHelper.addLocationToBuildException(ProjectHelper.java:539)

at org.apache.tools.ant.taskdefs.Ant.execute(Ant.java:384)

at org.apache.tools.ant.UnknownElement.execute(UnknownElement.java:275)

at org.apache.tools.ant.Task.perform(Task.java:364)

at org.apache.tools.ant.Target.execute(Target.java:342)

at org.apache.tools.ant.Target.performTasks(Target.java:370)

at org.apache.tools.ant.Project.executeSortedTargets(Project.java:1216)

at org.apache.tools.ant.helper.SingleCheckExecutor.executeTargets(SingleCheckExecutor.java:37)

at org.apache.tools.ant.Project.executeTargets(Project.java:1068)

at org.apache.tools.ant.taskdefs.Ant.execute(Ant.java:382)

... 21 more
Caused by: D:\NIKU\Install\PMO_2.2\package\install.xml:135: The following error occurred while executing this line:
D:\NIKU\Install\PMO_2.2\package\install.xml:271: exec returned: 2

at org.apache.tools.ant.ProjectHelper.addLocationToBuildException(ProjectHelper.java:539)

at org.apache.tools.ant.taskdefs.Ant.execute(Ant.java:384)

at org.apache.tools.ant.taskdefs.CallTarget.execute(CallTarget.java:107)

at com.niku.tools.taskdefs.IfTask.execute(IfTask.java:209)

at org.apache.tools.ant.Task.perform(Task.java:364)

at com.niku.tools.taskdefs.ChooseTask.execute(ChooseTask.java:132)

at org.apache.tools.ant.UnknownElement.execute(UnknownElement.java:275)

at org.apache.tools.ant.Task.perform(Task.java:364)

at org.apache.tools.ant.Target.execute(Target.java:342)

at org.apache.tools.ant.Target.performTasks(Target.java:370)

at org.apache.tools.ant.Project.executeSortedTargets(Project.java:1216)

at org.apache.tools.ant.helper.SingleCheckExecutor.executeTargets(SingleCheckExecutor.java:37)

at org.apache.tools.ant.Project.executeTargets(Project.java:1068)

at org.apache.tools.ant.taskdefs.Ant.execute(Ant.java:382)

... 29 more
Caused by: D:\NIKU\Install\PMO_2.2\package\install.xml:271: exec returned: 2

at org.apache.tools.ant.taskdefs.ExecTask.runExecute(ExecTask.java:591)

at org.apache.tools.ant.taskdefs.ExecTask.runExec(ExecTask.java:617)

at org.apache.tools.ant.taskdefs.ExecTask.execute(ExecTask.java:452)

at org.apache.tools.ant.UnknownElement.execute(UnknownElement.java:275)

at org.apache.tools.ant.Task.perform(Task.java:364)

at org.apache.tools.ant.Target.execute(Target.java:342)

at org.apache.tools.ant.Target.performTasks(Target.java:370)

at org.apache.tools.ant.Project.executeSortedTargets(Project.java:1216)

at org.apache.tools.ant.helper.SingleCheckExecutor.executeTargets(SingleCheckExecutor.java:37)

at org.apache.tools.ant.Project.executeTargets(Project.java:1068)

at org.apache.tools.ant.taskdefs.Ant.execute(Ant.java:382)

... 41 more
--- Nested Exception ---
D:\NIKU\Install\PMO_2.2\install.xml:73: The following error occurred while executing this line:
D:\NIKU\Install\PMO_2.2\package\install.xml:135: The following error occurred while executing this line:
D:\NIKU\Install\PMO_2.2\package\install.xml:271: exec returned: 2

at org.apache.tools.ant.ProjectHelper.addLocationToBuildException(ProjectHelper.java:539)

at org.apache.tools.ant.taskdefs.Ant.execute(Ant.java:384)

at org.apache.tools.ant.UnknownElement.execute(UnknownElement.java:275)

at org.apache.tools.ant.Task.perform(Task.java:364)

at org.apache.tools.ant.Target.execute(Target.java:342)

at org.apache.tools.ant.Target.performTasks(Target.java:370)

at org.apache.tools.ant.Project.executeSortedTargets(Project.java:1216)

at org.apache.tools.ant.helper.SingleCheckExecutor.executeTargets(SingleCheckExecutor.java:37)

at org.apache.tools.ant.Project.executeTargets(Project.java:1068)

at org.apache.tools.ant.taskdefs.Ant.execute(Ant.java:382)

at org.apache.tools.ant.taskdefs.CallTarget.execute(CallTarget.java:107)

at com.niku.tools.taskdefs.IfTask.execute(IfTask.java:209)

at org.apache.tools.ant.Task.perform(Task.java:364)

at com.niku.tools.taskdefs.ChooseTask.execute(ChooseTask.java:132)

at org.apache.tools.ant.UnknownElement.execute(UnknownElement.java:275)

at org.apache.tools.ant.Task.perform(Task.java:364)

at com.niku.tools.taskdefs.IfTask.execute(IfTask.java:204)

at org.apache.tools.ant.Task.perform(Task.java:364)

at com.niku.tools.taskdefs.ChooseTask.execute(ChooseTask.java:132)

at org.apache.tools.ant.UnknownElement.execute(UnknownElement.java:275)

at org.apache.tools.ant.Task.perform(Task.java:364)

at org.apache.tools.ant.Target.execute(Target.java:342)

at org.apache.tools.ant.Target.performTasks(Target.java:370)

at org.apache.tools.ant.Project.executeSortedTargets(Project.java:1216)

at org.apache.tools.ant.Project.executeTarget(Project.java:1185)

at org.apache.tools.ant.helper.DefaultExecutor.executeTargets(DefaultExecutor.java:40)

at org.apache.tools.ant.Project.executeTargets(Project.java:1068)

at org.apache.tools.ant.Main.runBuild(Main.java:675)

at org.apache.tools.ant.Main.startAnt(Main.java:190)

at org.apache.tools.ant.launch.Launcher.run(Launcher.java:246)

at org.apache.tools.ant.launch.Launcher.main(Launcher.java:67)
Caused by: D:\NIKU\Install\PMO_2.2\package\install.xml:135: The following error occurred while executing this line:
D:\NIKU\Install\PMO_2.2\package\install.xml:271: exec returned: 2

at org.apache.tools.ant.ProjectHelper.addLocationToBuildException(ProjectHelper.java:539)

at org.apache.tools.ant.taskdefs.Ant.execute(Ant.java:384)

at org.apache.tools.ant.taskdefs.CallTarget.execute(CallTarget.java:107)

at com.niku.tools.taskdefs.IfTask.execute(IfTask.java:209)

at org.apache.tools.ant.Task.perform(Task.java:364)

at com.niku.tools.taskdefs.ChooseTask.execute(ChooseTask.java:132)

at org.apache.tools.ant.UnknownElement.execute(UnknownElement.java:275)

at org.apache.tools.ant.Task.perform(Task.java:364)

at org.apache.tools.ant.Target.execute(Target.java:342)

at org.apache.tools.ant.Target.performTasks(Target.java:370)

at org.apache.tools.ant.Project.executeSortedTargets(Project.java:1216)

at org.apache.tools.ant.helper.SingleCheckExecutor.executeTargets(SingleCheckExecutor.java:37)

at org.apache.tools.ant.Project.executeTargets(Project.java:1068)

at org.apache.tools.ant.taskdefs.Ant.execute(Ant.java:382)

... 29 more
Caused by: D:\NIKU\Install\PMO_2.2\package\install.xml:271: exec returned: 2

at org.apache.tools.ant.taskdefs.ExecTask.runExecute(ExecTask.java:591)

at org.apache.tools.ant.taskdefs.ExecTask.runExec(ExecTask.java:617)

at org.apache.tools.ant.taskdefs.ExecTask.execute(ExecTask.java:452)

at org.apache.tools.ant.UnknownElement.execute(UnknownElement.java:275)

at org.apache.tools.ant.Task.perform(Task.java:364)

at org.apache.tools.ant.Target.execute(Target.java:342)

at org.apache.tools.ant.Target.performTasks(Target.java:370)

at org.apache.tools.ant.Project.executeSortedTargets(Project.java:1216)

at org.apache.tools.ant.helper.SingleCheckExecutor.executeTargets(SingleCheckExecutor.java:37)

at org.apache.tools.ant.Project.executeTargets(Project.java:1068)

at org.apache.tools.ant.taskdefs.Ant.execute(Ant.java:382)

... 41 more
--- Nested Exception ---
D:\NIKU\Install\PMO_2.2\package\install.xml:135: The following error occurred while executing this line:
D:\NIKU\Install\PMO_2.2\package\install.xml:271: exec returned: 2

at org.apache.tools.ant.ProjectHelper.addLocationToBuildException(ProjectHelper.java:539)

at org.apache.tools.ant.taskdefs.Ant.execute(Ant.java:384)

at org.apache.tools.ant.taskdefs.CallTarget.execute(CallTarget.java:107)

at com.niku.tools.taskdefs.IfTask.execute(IfTask.java:209)

at org.apache.tools.ant.Task.perform(Task.java:364)

at com.niku.tools.taskdefs.ChooseTask.execute(ChooseTask.java:132)

at org.apache.tools.ant.UnknownElement.execute(UnknownElement.java:275)

at org.apache.tools.ant.Task.perform(Task.java:364)

at org.apache.tools.ant.Target.execute(Target.java:342)

at org.apache.tools.ant.Target.performTasks(Target.java:370)

at org.apache.tools.ant.Project.executeSortedTargets(Project.java:1216)

at org.apache.tools.ant.helper.SingleCheckExecutor.executeTargets(SingleCheckExecutor.java:37)

at org.apache.tools.ant.Project.executeTargets(Project.java:1068)

at org.apache.tools.ant.taskdefs.Ant.execute(Ant.java:382)

at org.apache.tools.ant.UnknownElement.execute(UnknownElement.java:275)

at org.apache.tools.ant.Task.perform(Task.java:364)

at org.apache.tools.ant.Target.execute(Target.java:342)

at org.apache.tools.ant.Target.performTasks(Target.java:370)

at org.apache.tools.ant.Project.executeSortedTargets(Project.java:1216)

at org.apache.tools.ant.helper.SingleCheckExecutor.executeTargets(SingleCheckExecutor.java:37)

at org.apache.tools.ant.Project.executeTargets(Project.java:1068)

at org.apache.tools.ant.taskdefs.Ant.execute(Ant.java:382)

at org.apache.tools.ant.taskdefs.CallTarget.execute(CallTarget.java:107)

at com.niku.tools.taskdefs.IfTask.execute(IfTask.java:209)

at org.apache.tools.ant.Task.perform(Task.java:364)

at com.niku.tools.taskdefs.ChooseTask.execute(ChooseTask.java:132)

at org.apache.tools.ant.UnknownElement.execute(UnknownElement.java:275)

at org.apache.tools.ant.Task.perform(Task.java:364)

at com.niku.tools.taskdefs.IfTask.execute(IfTask.java:204)

at org.apache.tools.ant.Task.perform(Task.java:364)

at com.niku.tools.taskdefs.ChooseTask.execute(ChooseTask.java:132)

at org.apache.tools.ant.UnknownElement.execute(UnknownElement.java:275)

at org.apache.tools.ant.Task.perform(Task.java:364)

at org.apache.tools.ant.Target.execute(Target.java:342)

at org.apache.tools.ant.Target.performTasks(Target.java:370)

at org.apache.tools.ant.Project.executeSortedTargets(Project.java:1216)

at org.apache.tools.ant.Project.executeTarget(Project.java:1185)

at org.apache.tools.ant.helper.DefaultExecutor.executeTargets(DefaultExecutor.java:40)

at org.apache.tools.ant.Project.executeTargets(Project.java:1068)

at org.apache.tools.ant.Main.runBuild(Main.java:675)

at org.apache.tools.ant.Main.startAnt(Main.java:190)

at org.apache.tools.ant.launch.Launcher.run(Launcher.java:246)

at org.apache.tools.ant.launch.Launcher.main(Launcher.java:67)
Caused by: D:\NIKU\Install\PMO_2.2\package\install.xml:271: exec returned: 2

at org.apache.tools.ant.taskdefs.ExecTask.runExecute(ExecTask.java:591)

at org.apache.tools.ant.taskdefs.ExecTask.runExec(ExecTask.java:617)

at org.apache.tools.ant.taskdefs.ExecTask.execute(ExecTask.java:452)

at org.apache.tools.ant.UnknownElement.execute(UnknownElement.java:275)

at org.apache.tools.ant.Task.perform(Task.java:364)

at org.apache.tools.ant.Target.execute(Target.java:342)

at org.apache.tools.ant.Target.performTasks(Target.java:370)

at org.apache.tools.ant.Project.executeSortedTargets(Project.java:1216)

at org.apache.tools.ant.helper.SingleCheckExecutor.executeTargets(SingleCheckExecutor.java:37)

at org.apache.tools.ant.Project.executeTargets(Project.java:1068)

at org.apache.tools.ant.taskdefs.Ant.execute(Ant.java:382)

... 41 more
--- Nested Exception ---
D:\NIKU\Install\PMO_2.2\package\install.xml:271: exec returned: 2

at org.apache.tools.ant.taskdefs.ExecTask.runExecute(ExecTask.java:591)

at org.apache.tools.ant.taskdefs.ExecTask.runExec(ExecTask.java:617)

at org.apache.tools.ant.taskdefs.ExecTask.execute(ExecTask.java:452)

at org.apache.tools.ant.UnknownElement.execute(UnknownElement.java:275)

at org.apache.tools.ant.Task.perform(Task.java:364)

at org.apache.tools.ant.Target.execute(Target.java:342)

at org.apache.tools.ant.Target.performTasks(Target.java:370)

at org.apache.tools.ant.Project.executeSortedTargets(Project.java:1216)

at org.apache.tools.ant.helper.SingleCheckExecutor.executeTargets(SingleCheckExecutor.java:37)

at org.apache.tools.ant.Project.executeTargets(Project.java:1068)

at org.apache.tools.ant.taskdefs.Ant.execute(Ant.java:382)

at org.apache.tools.ant.taskdefs.CallTarget.execute(CallTarget.java:107)

at com.niku.tools.taskdefs.IfTask.execute(IfTask.java:209)

at org.apache.tools.ant.Task.perform(Task.java:364)

at com.niku.tools.taskdefs.ChooseTask.execute(ChooseTask.java:132)

at org.apache.tools.ant.UnknownElement.execute(UnknownElement.java:275)

at org.apache.tools.ant.Task.perform(Task.java:364)

at org.apache.tools.ant.Target.execute(Target.java:342)

at org.apache.tools.ant.Target.performTasks(Target.java:370)

at org.apache.tools.ant.Project.executeSortedTargets(Project.java:1216)

at org.apache.tools.ant.helper.SingleCheckExecutor.executeTargets(SingleCheckExecutor.java:37)

at org.apache.tools.ant.Project.executeTargets(Project.java:1068)

at org.apache.tools.ant.taskdefs.Ant.execute(Ant.java:382)

at org.apache.tools.ant.UnknownElement.execute(UnknownElement.java:275)

at org.apache.tools.ant.Task.perform(Task.java:364)

at org.apache.tools.ant.Target.execute(Target.java:342)

at org.apache.tools.ant.Target.performTasks(Target.java:370)

at org.apache.tools.ant.Project.executeSortedTargets(Project.java:1216)

at org.apache.tools.ant.helper.SingleCheckExecutor.executeTargets(SingleCheckExecutor.java:37)

at org.apache.tools.ant.Project.executeTargets(Project.java:1068)

at org.apache.tools.ant.taskdefs.Ant.execute(Ant.java:382)

at org.apache.tools.ant.taskdefs.CallTarget.execute(CallTarget.java:107)

at com.niku.tools.taskdefs.IfTask.execute(IfTask.java:209)

at org.apache.tools.ant.Task.perform(Task.java:364)

at com.niku.tools.taskdefs.ChooseTask.execute(ChooseTask.java:132)

at org.apache.tools.ant.UnknownElement.execute(UnknownElement.java:275)

at org.apache.tools.ant.Task.perform(Task.java:364)

at com.niku.tools.taskdefs.IfTask.execute(IfTask.java:204)

at org.apache.tools.ant.Task.perform(Task.java:364)

at com.niku.tools.taskdefs.ChooseTask.execute(ChooseTask.java:132)

at org.apache.tools.ant.UnknownElement.execute(UnknownElement.java:275)

at org.apache.tools.ant.Task.perform(Task.java:364)

at org.apache.tools.ant.Target.execute(Target.java:342)

at org.apache.tools.ant.Target.performTasks(Target.java:370)

at org.apache.tools.ant.Project.executeSortedTargets(Project.java:1216)

at org.apache.tools.ant.Project.executeTarget(Project.java:1185)

at org.apache.tools.ant.helper.DefaultExecutor.executeTargets(DefaultExecutor.java:40)

at org.apache.tools.ant.Project.executeTargets(Project.java:1068)

at org.apache.tools.ant.Main.runBuild(Main.java:675)

at org.apache.tools.ant.Main.startAnt(Main.java:190)

at org.apache.tools.ant.launch.Launcher.run(Launcher.java:246)

at org.apache.tools.ant.launch.Launcher.main(Launcher.java:67)
[echo]
-------------------------------------------------------------
This program will install package csk:

See the included README.txt for more information.
-------------------------------------------------------------


_install:
[echo]

init:

install:
[echo]
-------------------------------------------------------------
This program will install the PMO Accelerator

Version: 2.2.0

Warning:

* The PMO Accelerator cannot
be automatically uninstalled.

* The PMO Accelerator sample data,
which can be installed separately,
is intended for demonstration
purposes only and should not be
installed to a production server.
There is no mechanism for
uninstalling the sample data.

* This PMO Accelerator
update must be applied against
Clarity version 12.1.0 or higher.

* Review the Read Me file prior to installation.
-------------------------------------------------------------

[echo]

init:

files:

pack-config:

remove-attribute:
[echo] Removing obj_alignment attribute...
[java] Attribute with the given specifications {ext_type=formula, attribute=obj_alignment, object=inv, type=number} not found. No removal necessary.

protect-view:
[echo] Getting view information...
[java] Starting view protection
[java] Completed view protection

deploy:
[exec] Content Pack csk version 8.1.0.4247 has been deployed
[exec] Installing content... csk
[exec] Installing content items that do not already exist or have the force option set to true
[exec] ==========================================
[exec] DBTools Log - Wed Mar 28 15:10:59 CDT 2012
[exec] ==========================================
[exec]
[exec] Command: install database schema from driver file
[exec] To URL: jdbc:clarity:sqlserver://ndcmsqld03:1433;DatabaseName=niku;InsensitiveResultSetBufferSize=0;ProgramName=Clarity
[exec] As user: Niku
[exec] For vendor: mssql
[exec] Loading DBDriver file: d:\NIKU\Clarity\database\content\csk\preupgrade-driver.xml
[exec] Loading DBDriver file: d:\NIKU\Clarity\database\content\csk\preupgrade-driver.xml
[exec] Current database version is database_csk_2.2.0.0007-preupgrade
[exec] DBDriver for database_csk_2.2.0.0007-preupgrade
[exec] DBDriver has already been installed!
[exec]
[exec] Total time: 0H:0M:1S
[exec] - Initializing: pma.init...
[exec] SYS 2012-03-28 15:11:02,152 [main] niku.union Initializing: pma.init...

BUILD FAILED

D:\NIKU\Install\PMO_2.2\install.xml:58: The following error occurred while executing this line:
D:\NIKU\Install\PMO_2.2\install.xml:73: The following error occurred while executing this line:
D:\NIKU\Install\PMO_2.2\package\install.xml:135: The following error occurred while executing this line:
D:\NIKU\Install\PMO_2.2\package\install.xml:271: exec returned: 2

at org.apache.tools.ant.ProjectHelper.addLocationToBuildException(ProjectHelper.java:539)

at org.apache.tools.ant.taskdefs.Ant.execute(Ant.java:384)

at org.apache.tools.ant.taskdefs.CallTarget.execute(CallTarget.java:107)

at com.niku.tools.taskdefs.IfTask.execute(IfTask.java:209)

at org.apache.tools.ant.Task.perform(Task.java:364)

at com.niku.tools.taskdefs.ChooseTask.execute(ChooseTask.java:132)

at org.apache.tools.ant.UnknownElement.execute(UnknownElement.java:275)

at org.apache.tools.ant.Task.perform(Task.java:364)

at com.niku.tools.taskdefs.IfTask.execute(IfTask.java:204)

at org.apache.tools.ant.Task.perform(Task.java:364)

at com.niku.tools.taskdefs.ChooseTask.execute(ChooseTask.java:132)

at org.apache.tools.ant.UnknownElement.execute(UnknownElement.java:275)

at org.apache.tools.ant.Task.perform(Task.java:364)

at org.apache.tools.ant.Target.execute(Target.java:342)

at org.apache.tools.ant.Target.performTasks(Target.java:370)

at org.apache.tools.ant.Project.executeSortedTargets(Project.java:1216)

at org.apache.tools.ant.Project.executeTarget(Project.java:1185)

at org.apache.tools.ant.helper.DefaultExecutor.executeTargets(DefaultExecutor.java:40)

at org.apache.tools.ant.Project.executeTargets(Project.java:1068)

at org.apache.tools.ant.Main.runBuild(Main.java:675)

at org.apache.tools.ant.Main.startAnt(Main.java:190)

at org.apache.tools.ant.launch.Launcher.run(Launcher.java:246)

at org.apache.tools.ant.launch.Launcher.main(Launcher.java:67)
Caused by: D:\NIKU\Install\PMO_2.2\install.xml:73: The following error occurred while executing this line:
D:\NIKU\Install\PMO_2.2\package\install.xml:135: The following error occurred while executing this line:
D:\NIKU\Install\PMO_2.2\package\install.xml:271: exec returned: 2

at org.apache.tools.ant.ProjectHelper.addLocationToBuildException(ProjectHelper.java:539)

at org.apache.tools.ant.taskdefs.Ant.execute(Ant.java:384)

at org.apache.tools.ant.UnknownElement.execute(UnknownElement.java:275)

at org.apache.tools.ant.Task.perform(Task.java:364)

at org.apache.tools.ant.Target.execute(Target.java:342)

at org.apache.tools.ant.Target.performTasks(Target.java:370)

at org.apache.tools.ant.Project.executeSortedTargets(Project.java:1216)

at org.apache.tools.ant.helper.SingleCheckExecutor.executeTargets(SingleCheckExecutor.java:37)

at org.apache.tools.ant.Project.executeTargets(Project.java:1068)

at org.apache.tools.ant.taskdefs.Ant.execute(Ant.java:382)

... 21 more
Caused by: D:\NIKU\Install\PMO_2.2\package\install.xml:135: The following error occurred while executing this line:
D:\NIKU\Install\PMO_2.2\package\install.xml:271: exec returned: 2

at org.apache.tools.ant.ProjectHelper.addLocationToBuildException(ProjectHelper.java:539)

at org.apache.tools.ant.taskdefs.Ant.execute(Ant.java:384)

at org.apache.tools.ant.taskdefs.CallTarget.execute(CallTarget.java:107)

at com.niku.tools.taskdefs.IfTask.execute(IfTask.java:209)

at org.apache.tools.ant.Task.perform(Task.java:364)

at com.niku.tools.taskdefs.ChooseTask.execute(ChooseTask.java:132)

at org.apache.tools.ant.UnknownElement.execute(UnknownElement.java:275)

at org.apache.tools.ant.Task.perform(Task.java:364)

at org.apache.tools.ant.Target.execute(Target.java:342)

at org.apache.tools.ant.Target.performTasks(Target.java:370)

at org.apache.tools.ant.Project.executeSortedTargets(Project.java:1216)

at org.apache.tools.ant.helper.SingleCheckExecutor.executeTargets(SingleCheckExecutor.java:37)

at org.apache.tools.ant.Project.executeTargets(Project.java:1068)

at org.apache.tools.ant.taskdefs.Ant.execute(Ant.java:382)

... 29 more
Caused by: D:\NIKU\Install\PMO_2.2\package\install.xml:271: exec returned: 2

at org.apache.tools.ant.taskdefs.ExecTask.runExecute(ExecTask.java:591)

at org.apache.tools.ant.taskdefs.ExecTask.runExec(ExecTask.java:617)

at org.apache.tools.ant.taskdefs.ExecTask.execute(ExecTask.java:452)

at org.apache.tools.ant.UnknownElement.execute(UnknownElement.java:275)

at org.apache.tools.ant.Task.perform(Task.java:364)

at org.apache.tools.ant.Target.execute(Target.java:342)

at org.apache.tools.ant.Target.performTasks(Target.java:370)

at org.apache.tools.ant.Project.executeSortedTargets(Project.java:1216)

at org.apache.tools.ant.helper.SingleCheckExecutor.executeTargets(SingleCheckExecutor.java:37)

at org.apache.tools.ant.Project.executeTargets(Project.java:1068)

at org.apache.tools.ant.taskdefs.Ant.execute(Ant.java:382)

... 41 more
--- Nested Exception ---
D:\NIKU\Install\PMO_2.2\install.xml:73: The following error occurred while executing this line:
D:\NIKU\Install\PMO_2.2\package\install.xml:135: The following error occurred while executing this line:
D:\NIKU\Install\PMO_2.2\package\install.xml:271: exec returned: 2

at org.apache.tools.ant.ProjectHelper.addLocationToBuildException(ProjectHelper.java:539)

at org.apache.tools.ant.taskdefs.Ant.execute(Ant.java:384)

at org.apache.tools.ant.UnknownElement.execute(UnknownElement.java:275)

at org.apache.tools.ant.Task.perform(Task.java:364)

at org.apache.tools.ant.Target.execute(Target.java:342)

at org.apache.tools.ant.Target.performTasks(Target.java:370)

at org.apache.tools.ant.Project.executeSortedTargets(Project.java:1216)

at org.apache.tools.ant.helper.SingleCheckExecutor.executeTargets(SingleCheckExecutor.java:37)

at org.apache.tools.ant.Project.executeTargets(Project.java:1068)

at org.apache.tools.ant.taskdefs.Ant.execute(Ant.java:382)

at org.apache.tools.ant.taskdefs.CallTarget.execute(CallTarget.java:107)

at com.niku.tools.taskdefs.IfTask.execute(IfTask.java:209)

at org.apache.tools.ant.Task.perform(Task.java:364)

at com.niku.tools.taskdefs.ChooseTask.execute(ChooseTask.java:132)

at org.apache.tools.ant.UnknownElement.execute(UnknownElement.java:275)

at org.apache.tools.ant.Task.perform(Task.java:364)

at com.niku.tools.taskdefs.IfTask.execute(IfTask.java:204)

at org.apache.tools.ant.Task.perform(Task.java:364)

at com.niku.tools.taskdefs.ChooseTask.execute(ChooseTask.java:132)

at org.apache.tools.ant.UnknownElement.execute(UnknownElement.java:275)

at org.apache.tools.ant.Task.perform(Task.java:364)

at org.apache.tools.ant.Target.execute(Target.java:342)

at org.apache.tools.ant.Target.performTasks(Target.java:370)

at org.apache.tools.ant.Project.executeSortedTargets(Project.java:1216)

at org.apache.tools.ant.Project.executeTarget(Project.java:1185)

at org.apache.tools.ant.helper.DefaultExecutor.executeTargets(DefaultExecutor.java:40)

at org.apache.tools.ant.Project.executeTargets(Project.java:1068)

at org.apache.tools.ant.Main.runBuild(Main.java:675)

at org.apache.tools.ant.Main.startAnt(Main.java:190)

at org.apache.tools.ant.launch.Launcher.run(Launcher.java:246)

at org.apache.tools.ant.launch.Launcher.main(Launcher.java:67)
Caused by: D:\NIKU\Install\PMO_2.2\package\install.xml:135: The following error occurred while executing this line:
D:\NIKU\Install\PMO_2.2\package\install.xml:271: exec returned: 2

at org.apache.tools.ant.ProjectHelper.addLocationToBuildException(ProjectHelper.java:539)

at org.apache.tools.ant.taskdefs.Ant.execute(Ant.java:384)

at org.apache.tools.ant.taskdefs.CallTarget.execute(CallTarget.java:107)

at com.niku.tools.taskdefs.IfTask.execute(IfTask.java:209)

at org.apache.tools.ant.Task.perform(Task.java:364)

at com.niku.tools.taskdefs.ChooseTask.execute(ChooseTask.java:132)

at org.apache.tools.ant.UnknownElement.execute(UnknownElement.java:275)

at org.apache.tools.ant.Task.perform(Task.java:364)

at org.apache.tools.ant.Target.execute(Target.java:342)

at org.apache.tools.ant.Target.performTasks(Target.java:370)

at org.apache.tools.ant.Project.executeSortedTargets(Project.java:1216)

at org.apache.tools.ant.helper.SingleCheckExecutor.executeTargets(SingleCheckExecutor.java:37)

at org.apache.tools.ant.Project.executeTargets(Project.java:1068)

at org.apache.tools.ant.taskdefs.Ant.execute(Ant.java:382)

... 29 more
Caused by: D:\NIKU\Install\PMO_2.2\package\install.xml:271: exec returned: 2

at org.apache.tools.ant.taskdefs.ExecTask.runExecute(ExecTask.java:591)

at org.apache.tools.ant.taskdefs.ExecTask.runExec(ExecTask.java:617)

at org.apache.tools.ant.taskdefs.ExecTask.execute(ExecTask.java:452)

at org.apache.tools.ant.UnknownElement.execute(UnknownElement.java:275)

at org.apache.tools.ant.Task.perform(Task.java:364)

at org.apache.tools.ant.Target.execute(Target.java:342)

at org.apache.tools.ant.Target.performTasks(Target.java:370)

at org.apache.tools.ant.Project.executeSortedTargets(Project.java:1216)

at org.apache.tools.ant.helper.SingleCheckExecutor.executeTargets(SingleCheckExecutor.java:37)

at org.apache.tools.ant.Project.executeTargets(Project.java:1068)

at org.apache.tools.ant.taskdefs.Ant.execute(Ant.java:382)

... 41 more
--- Nested Exception ---
D:\NIKU\Install\PMO_2.2\package\install.xml:135: The following error occurred while executing this line:
D:\NIKU\Install\PMO_2.2\package\install.xml:271: exec returned: 2

at org.apache.tools.ant.ProjectHelper.addLocationToBuildException(ProjectHelper.java:539)

at org.apache.tools.ant.taskdefs.Ant.execute(Ant.java:384)

at org.apache.tools.ant.taskdefs.CallTarget.execute(CallTarget.java:107)

at com.niku.tools.taskdefs.IfTask.execute(IfTask.java:209)

at org.apache.tools.ant.Task.perform(Task.java:364)

at com.niku.tools.taskdefs.ChooseTask.execute(ChooseTask.java:132)

at org.apache.tools.ant.UnknownElement.execute(UnknownElement.java:275)

at org.apache.tools.ant.Task.perform(Task.java:364)

at org.apache.tools.ant.Target.execute(Target.java:342)

at org.apache.tools.ant.Target.performTasks(Target.java:370)

at org.apache.tools.ant.Project.executeSortedTargets(Project.java:1216)

at org.apache.tools.ant.helper.SingleCheckExecutor.executeTargets(SingleCheckExecutor.java:37)

at org.apache.tools.ant.Project.executeTargets(Project.java:1068)

at org.apache.tools.ant.taskdefs.Ant.execute(Ant.java:382)

at org.apache.tools.ant.UnknownElement.execute(UnknownElement.java:275)

at org.apache.tools.ant.Task.perform(Task.java:364)

at org.apache.tools.ant.Target.execute(Target.java:342)

at org.apache.tools.ant.Target.performTasks(Target.java:370)

at org.apache.tools.ant.Project.executeSortedTargets(Project.java:1216)

at org.apache.tools.ant.helper.SingleCheckExecutor.executeTargets(SingleCheckExecutor.java:37)

at org.apache.tools.ant.Project.executeTargets(Project.java:1068)

at org.apache.tools.ant.taskdefs.Ant.execute(Ant.java:382)

at org.apache.tools.ant.taskdefs.CallTarget.execute(CallTarget.java:107)

at com.niku.tools.taskdefs.IfTask.execute(IfTask.java:209)

at org.apache.tools.ant.Task.perform(Task.java:364)

at com.niku.tools.taskdefs.ChooseTask.execute(ChooseTask.java:132)

at org.apache.tools.ant.UnknownElement.execute(UnknownElement.java:275)

at org.apache.tools.ant.Task.perform(Task.java:364)

at com.niku.tools.taskdefs.IfTask.execute(IfTask.java:204)

at org.apache.tools.ant.Task.perform(Task.java:364)

at com.niku.tools.taskdefs.ChooseTask.execute(ChooseTask.java:132)

at org.apache.tools.ant.UnknownElement.execute(UnknownElement.java:275)

at org.apache.tools.ant.Task.perform(Task.java:364)

at org.apache.tools.ant.Target.execute(Target.java:342)

at org.apache.tools.ant.Target.performTasks(Target.java:370)

at org.apache.tools.ant.Project.executeSortedTargets(Project.java:1216)

at org.apache.tools.ant.Project.executeTarget(Project.java:1185)

at org.apache.tools.ant.helper.DefaultExecutor.executeTargets(DefaultExecutor.java:40)

at org.apache.tools.ant.Project.executeTargets(Project.java:1068)

at org.apache.tools.ant.Main.runBuild(Main.java:675)

at org.apache.tools.ant.Main.startAnt(Main.java:190)

at org.apache.tools.ant.launch.Launcher.run(Launcher.java:246)

at org.apache.tools.ant.launch.Launcher.main(Launcher.java:67)
Caused by: D:\NIKU\Install\PMO_2.2\package\install.xml:271: exec returned: 2

at org.apache.tools.ant.taskdefs.ExecTask.runExecute(ExecTask.java:591)

at org.apache.tools.ant.taskdefs.ExecTask.runExec(ExecTask.java:617)

at org.apache.tools.ant.taskdefs.ExecTask.execute(ExecTask.java:452)

at org.apache.tools.ant.UnknownElement.execute(UnknownElement.java:275)

at org.apache.tools.ant.Task.perform(Task.java:364)

at org.apache.tools.ant.Target.execute(Target.java:342)

at org.apache.tools.ant.Target.performTasks(Target.java:370)

at org.apache.tools.ant.Project.executeSortedTargets(Project.java:1216)

at org.apache.tools.ant.helper.SingleCheckExecutor.executeTargets(SingleCheckExecutor.java:37)

at org.apache.tools.ant.Project.executeTargets(Project.java:1068)

at org.apache.tools.ant.taskdefs.Ant.execute(Ant.java:382)

... 41 more
--- Nested Exception ---
D:\NIKU\Install\PMO_2.2\package\install.xml:271: exec returned: 2

at org.apache.tools.ant.taskdefs.ExecTask.runExecute(ExecTask.java:591)

at org.apache.tools.ant.taskdefs.ExecTask.runExec(ExecTask.java:617)

at org.apache.tools.ant.taskdefs.ExecTask.execute(ExecTask.java:452)

at org.apache.tools.ant.UnknownElement.execute(UnknownElement.java:275)

at org.apache.tools.ant.Task.perform(Task.java:364)

at org.apache.tools.ant.Target.execute(Target.java:342)

at org.apache.tools.ant.Target.performTasks(Target.java:370)

at org.apache.tools.ant.Project.executeSortedTargets(Project.java:1216)

at org.apache.tools.ant.helper.SingleCheckExecutor.executeTargets(SingleCheckExecutor.java:37)

at org.apache.tools.ant.Project.executeTargets(Project.java:1068)

at org.apache.tools.ant.taskdefs.Ant.execute(Ant.java:382)

at org.apache.tools.ant.taskdefs.CallTarget.execute(CallTarget.java:107)

at com.niku.tools.taskdefs.IfTask.execute(IfTask.java:209)

at org.apache.tools.ant.Task.perform(Task.java:364)

at com.niku.tools.taskdefs.ChooseTask.execute(ChooseTask.java:132)

at org.apache.tools.ant.UnknownElement.execute(UnknownElement.java:275)

at org.apache.tools.ant.Task.perform(Task.java:364)

at org.apache.tools.ant.Target.execute(Target.java:342)

at org.apache.tools.ant.Target.performTasks(Target.java:370)

at org.apache.tools.ant.Project.executeSortedTargets(Project.java:1216)

at org.apache.tools.ant.helper.SingleCheckExecutor.executeTargets(SingleCheckExecutor.java:37)

at org.apache.tools.ant.Project.executeTargets(Project.java:1068)

at org.apache.tools.ant.taskdefs.Ant.execute(Ant.java:382)

at org.apache.tools.ant.UnknownElement.execute(UnknownElement.java:275)

at org.apache.tools.ant.Task.perform(Task.java:364)

at org.apache.tools.ant.Target.execute(Target.java:342)

at org.apache.tools.ant.Target.performTasks(Target.java:370)

at org.apache.tools.ant.Project.executeSortedTargets(Project.java:1216)

at org.apache.tools.ant.helper.SingleCheckExecutor.executeTargets(SingleCheckExecutor.java:37)

at org.apache.tools.ant.Project.executeTargets(Project.java:1068)

at org.apache.tools.ant.taskdefs.Ant.execute(Ant.java:382)

at org.apache.tools.ant.taskdefs.CallTarget.execute(CallTarget.java:107)

at com.niku.tools.taskdefs.IfTask.execute(IfTask.java:209)

at org.apache.tools.ant.Task.perform(Task.java:364)

at com.niku.tools.taskdefs.ChooseTask.execute(ChooseTask.java:132)

at org.apache.tools.ant.UnknownElement.execute(UnknownElement.java:275)

at org.apache.tools.ant.Task.perform(Task.java:364)

at com.niku.tools.taskdefs.IfTask.execute(IfTask.java:204)

at org.apache.tools.ant.Task.perform(Task.java:364)

at com.niku.tools.taskdefs.ChooseTask.execute(ChooseTask.java:132)

at org.apache.tools.ant.UnknownElement.execute(UnknownElement.java:275)

at org.apache.tools.ant.Task.perform(Task.java:364)

at org.apache.tools.ant.Target.execute(Target.java:342)

at org.apache.tools.ant.Target.performTasks(Target.java:370)

at org.apache.tools.ant.Project.executeSortedTargets(Project.java:1216)

at org.apache.tools.ant.Project.executeTarget(Project.java:1185)

at org.apache.tools.ant.helper.DefaultExecutor.executeTargets(DefaultExecutor.java:40)

at org.apache.tools.ant.Project.executeTargets(Project.java:1068)

at org.apache.tools.ant.Main.runBuild(Main.java:675)

at org.apache.tools.ant.Main.startAnt(Main.java:190)

at org.apache.tools.ant.launch.Launcher.run(Launcher.java:246)

at org.apache.tools.ant.launch.Launcher.main(Launcher.java:67)
[echo] Cannot find valid installation under d:\

BUILD SUCCESSFUL

BUILD FAILED

D:\NIKU\Install\PMO_2.2\install.xml:37: java.lang.NullPointerException

at org.apache.tools.ant.Task.perform(Task.java:373)

at com.niku.tools.taskdefs.CompleteTask.execute(CompleteTask.java:125)

at org.apache.tools.ant.UnknownElement.execute(UnknownElement.java:275)

at org.apache.tools.ant.Task.perform(Task.java:364)

at org.apache.tools.ant.Target.execute(Target.java:342)

at org.apache.tools.ant.Target.performTasks(Target.java:370)

at org.apache.tools.ant.Project.executeSortedTargets(Project.java:1216)

at org.apache.tools.ant.Project.executeTarget(Project.java:1185)

at org.apache.tools.ant.helper.DefaultExecutor.executeTargets(DefaultExecutor.java:40)

at org.apache.tools.ant.Project.executeTargets(Project.java:1068)

at org.apache.tools.ant.Main.runBuild(Main.java:675)

at org.apache.tools.ant.Main.startAnt(Main.java:190)

at org.apache.tools.ant.launch.Launcher.run(Launcher.java:246)

at org.apache.tools.ant.launch.Launcher.main(Launcher.java:67)
Caused by: java.lang.NullPointerException

at com.niku.tools.OrderedProperties.load(OrderedProperties.java:247)

at com.niku.tools.OrderedProperties.load(OrderedProperties.java:202)

at com.niku.tools.taskdefs.PropertySetupUtil.loadProperties(PropertySetupUtil.java:108)

at com.niku.tools.taskdefs.PropertySetupUtil.getProperties(PropertySetupUtil.java:41)

at com.niku.tools.taskdefs.setup.Query.execute(Query.java:236)

at com.niku.tools.taskdefs.setup.AbstractSetupUtil.processChildren(AbstractSetupUtil.java:179)

at com.niku.tools.taskdefs.setup.AbstractSetupUtil.execute(AbstractSetupUtil.java:145)

at org.apache.tools.ant.UnknownElement.execute(UnknownElement.java:275)

at org.apache.tools.ant.Task.perform(Task.java:364)

... 13 more
--- Nested Exception ---
java.lang.NullPointerException

at com.niku.tools.OrderedProperties.load(OrderedProperties.java:247)

at com.niku.tools.OrderedProperties.load(OrderedProperties.java:202)

at com.niku.tools.taskdefs.PropertySetupUtil.loadProperties(PropertySetupUtil.java:108)

at com.niku.tools.taskdefs.PropertySetupUtil.getProperties(PropertySetupUtil.java:41)

at com.niku.tools.taskdefs.setup.Query.execute(Query.java:236)

at com.niku.tools.taskdefs.setup.AbstractSetupUtil.processChildren(AbstractSetupUtil.java:179)

at com.niku.tools.taskdefs.setup.AbstractSetupUtil.execute(AbstractSetupUtil.java:145)

at org.apache.tools.ant.UnknownElement.execute(UnknownElement.java:275)

at org.apache.tools.ant.Task.perform(Task.java:364)

at com.niku.tools.taskdefs.CompleteTask.execute(CompleteTask.java:125)

at org.apache.tools.ant.UnknownElement.execute(UnknownElement.java:275)

at org.apache.tools.ant.Task.perform(Task.java:364)

at org.apache.tools.ant.Target.execute(Target.java:342)

at org.apache.tools.ant.Target.performTasks(Target.java:370)

at org.apache.tools.ant.Project.executeSortedTargets(Project.java:1216)

at org.apache.tools.ant.Project.executeTarget(Project.java:1185)

at org.apache.tools.ant.helper.DefaultExecutor.executeTargets(DefaultExecutor.java:40)

at org.apache.tools.ant.Project.executeTargets(Project.java:1068)

at org.apache.tools.ant.Main.runBuild(Main.java:675)

at org.apache.tools.ant.Main.startAnt(Main.java:190)

at org.apache.tools.ant.launch.Launcher.run(Launcher.java:246)

at org.apache.tools.ant.launch.Launcher.main(Launcher.java:67)

BUILD FAILED

D:\NIKU\Install\PMO_2.2\install.xml:37: java.lang.NullPointerException

at org.apache.tools.ant.Task.perform(Task.java:373)

at com.niku.tools.taskdefs.CompleteTask.execute(CompleteTask.java:125)

at org.apache.tools.ant.UnknownElement.execute(UnknownElement.java:275)

at org.apache.tools.ant.Task.perform(Task.java:364)

at org.apache.tools.ant.Target.execute(Target.java:342)

at org.apache.tools.ant.Target.performTasks(Target.java:370)

at org.apache.tools.ant.Project.executeSortedTargets(Project.java:1216)

at org.apache.tools.ant.Project.executeTarget(Project.java:1185)

at org.apache.tools.ant.helper.DefaultExecutor.executeTargets(DefaultExecutor.java:40)

at org.apache.tools.ant.Project.executeTargets(Project.java:1068)

at org.apache.tools.ant.Main.runBuild(Main.java:675)

at org.apache.tools.ant.Main.startAnt(Main.java:190)

at org.apache.tools.ant.launch.Launcher.run(Launcher.java:246)

at org.apache.tools.ant.launch.Launcher.main(Launcher.java:67)
Caused by: java.lang.NullPointerException

at com.niku.tools.OrderedProperties.load(OrderedProperties.java:247)

at com.niku.tools.OrderedProperties.load(OrderedProperties.java:202)

at com.niku.tools.taskdefs.PropertySetupUtil.loadProperties(PropertySetupUtil.java:108)

at com.niku.tools.taskdefs.PropertySetupUtil.getProperties(PropertySetupUtil.java:41)

at com.niku.tools.taskdefs.setup.Query.execute(Query.java:236)

at com.niku.tools.taskdefs.setup.AbstractSetupUtil.processChildren(AbstractSetupUtil.java:179)

at com.niku.tools.taskdefs.setup.AbstractSetupUtil.execute(AbstractSetupUtil.java:145)

at org.apache.tools.ant.UnknownElement.execute(UnknownElement.java:275)

at org.apache.tools.ant.Task.perform(Task.java:364)

... 13 more
--- Nested Exception ---
java.lang.NullPointerException

at com.niku.tools.OrderedProperties.load(OrderedProperties.java:247)

at com.niku.tools.OrderedProperties.load(OrderedProperties.java:202)

at com.niku.tools.taskdefs.PropertySetupUtil.loadProperties(PropertySetupUtil.java:108)

at com.niku.tools.taskdefs.PropertySetupUtil.getProperties(PropertySetupUtil.java:41)

at com.niku.tools.taskdefs.setup.Query.execute(Query.java:236)

at com.niku.tools.taskdefs.setup.AbstractSetupUtil.processChildren(AbstractSetupUtil.java:179)

at com.niku.tools.taskdefs.setup.AbstractSetupUtil.execute(AbstractSetupUtil.java:145)

at org.apache.tools.ant.UnknownElement.execute(UnknownElement.java:275)

at org.apache.tools.ant.Task.perform(Task.java:364)

at com.niku.tools.taskdefs.CompleteTask.execute(CompleteTask.java:125)

at org.apache.tools.ant.UnknownElement.execute(UnknownElement.java:275)

at org.apache.tools.ant.Task.perform(Task.java:364)

at org.apache.tools.ant.Target.execute(Target.java:342)

at org.apache.tools.ant.Target.performTasks(Target.java:370)

at org.apache.tools.ant.Project.executeSortedTargets(Project.java:1216)

at org.apache.tools.ant.Project.executeTarget(Project.java:1185)

at org.apache.tools.ant.helper.DefaultExecutor.executeTargets(DefaultExecutor.java:40)

at org.apache.tools.ant.Project.executeTargets(Project.java:1068)

at org.apache.tools.ant.Main.runBuild(Main.java:675)

at org.apache.tools.ant.Main.startAnt(Main.java:190)

at org.apache.tools.ant.launch.Launcher.run(Launcher.java:246)

at org.apache.tools.ant.launch.Launcher.main(Launcher.java:67)

BUILD FAILED

D:\NIKU\Install\PMO_2.2\install.xml:37: java.lang.NullPointerException

at org.apache.tools.ant.Task.perform(Task.java:373)

at com.niku.tools.taskdefs.CompleteTask.execute(CompleteTask.java:125)

at org.apache.tools.ant.UnknownElement.execute(UnknownElement.java:275)

at org.apache.tools.ant.Task.perform(Task.java:364)

at org.apache.tools.ant.Target.execute(Target.java:342)

at org.apache.tools.ant.Target.performTasks(Target.java:370)

at org.apache.tools.ant.Project.executeSortedTargets(Project.java:1216)

at org.apache.tools.ant.Project.executeTarget(Project.java:1185)

at org.apache.tools.ant.helper.DefaultExecutor.executeTargets(DefaultExecutor.java:40)

at org.apache.tools.ant.Project.executeTargets(Project.java:1068)

at org.apache.tools.ant.Main.runBuild(Main.java:675)

at org.apache.tools.ant.Main.startAnt(Main.java:190)

at org.apache.tools.ant.launch.Launcher.run(Launcher.java:246)

at org.apache.tools.ant.launch.Launcher.main(Launcher.java:67)
Caused by: java.lang.NullPointerException

at com.niku.tools.OrderedProperties.load(OrderedProperties.java:247)

at com.niku.tools.OrderedProperties.load(OrderedProperties.java:202)

at com.niku.tools.taskdefs.PropertySetupUtil.loadProperties(PropertySetupUtil.java:108)

at com.niku.tools.taskdefs.PropertySetupUtil.getProperties(PropertySetupUtil.java:41)

at com.niku.tools.taskdefs.setup.Query.execute(Query.java:236)

at com.niku.tools.taskdefs.setup.AbstractSetupUtil.processChildren(AbstractSetupUtil.java:179)

at com.niku.tools.taskdefs.setup.AbstractSetupUtil.execute(AbstractSetupUtil.java:145)

at org.apache.tools.ant.UnknownElement.execute(UnknownElement.java:275)

at org.apache.tools.ant.Task.perform(Task.java:364)

... 13 more
--- Nested Exception ---
java.lang.NullPointerException

at com.niku.tools.OrderedProperties.load(OrderedProperties.java:247)

at com.niku.tools.OrderedProperties.load(OrderedProperties.java:202)

at com.niku.tools.taskdefs.PropertySetupUtil.loadProperties(PropertySetupUtil.java:108)

at com.niku.tools.taskdefs.PropertySetupUtil.getProperties(PropertySetupUtil.java:41)

at com.niku.tools.taskdefs.setup.Query.execute(Query.java:236)

at com.niku.tools.taskdefs.setup.AbstractSetupUtil.processChildren(AbstractSetupUtil.java:179)

at com.niku.tools.taskdefs.setup.AbstractSetupUtil.execute(AbstractSetupUtil.java:145)

at org.apache.tools.ant.UnknownElement.execute(UnknownElement.java:275)

at org.apache.tools.ant.Task.perform(Task.java:364)

at com.niku.tools.taskdefs.CompleteTask.execute(CompleteTask.java:125)

at org.apache.tools.ant.UnknownElement.execute(UnknownElement.java:275)

at org.apache.tools.ant.Task.perform(Task.java:364)

at org.apache.tools.ant.Target.execute(Target.java:342)

at org.apache.tools.ant.Target.performTasks(Target.java:370)

at org.apache.tools.ant.Project.executeSortedTargets(Project.java:1216)

at org.apache.tools.ant.Project.executeTarget(Project.java:1185)

at org.apache.tools.ant.helper.DefaultExecutor.executeTargets(DefaultExecutor.java:40)

at org.apache.tools.ant.Project.executeTargets(Project.java:1068)

at org.apache.tools.ant.Main.runBuild(Main.java:675)

at org.apache.tools.ant.Main.startAnt(Main.java:190)

at org.apache.tools.ant.launch.Launcher.run(Launcher.java:246)

at org.apache.tools.ant.launch.Launcher.main(Launcher.java:67)

BUILD FAILED

D:\NIKU\Install\PMO_2.2\install.xml:37: java.lang.NullPointerException

at org.apache.tools.ant.Task.perform(Task.java:373)

at com.niku.tools.taskdefs.CompleteTask.execute(CompleteTask.java:125)

at org.apache.tools.ant.UnknownElement.execute(UnknownElement.java:275)

at org.apache.tools.ant.Task.perform(Task.java:364)

at org.apache.tools.ant.Target.execute(Target.java:342)

at org.apache.tools.ant.Target.performTasks(Target.java:370)

at org.apache.tools.ant.Project.executeSortedTargets(Project.java:1216)

at org.apache.tools.ant.Project.executeTarget(Project.java:1185)

at org.apache.tools.ant.helper.DefaultExecutor.executeTargets(DefaultExecutor.java:40)

at org.apache.tools.ant.Project.executeTargets(Project.java:1068)

at org.apache.tools.ant.Main.runBuild(Main.java:675)

at org.apache.tools.ant.Main.startAnt(Main.java:190)

at org.apache.tools.ant.launch.Launcher.run(Launcher.java:246)

at org.apache.tools.ant.launch.Launcher.main(Launcher.java:67)
Caused by: java.lang.NullPointerException

at com.niku.tools.OrderedProperties.load(OrderedProperties.java:247)

at com.niku.tools.OrderedProperties.load(OrderedProperties.java:202)

at com.niku.tools.taskdefs.PropertySetupUtil.loadProperties(PropertySetupUtil.java:108)

at com.niku.tools.taskdefs.PropertySetupUtil.getProperties(PropertySetupUtil.java:41)

at com.niku.tools.taskdefs.setup.Query.execute(Query.java:236)

at com.niku.tools.taskdefs.setup.AbstractSetupUtil.processChildren(AbstractSetupUtil.java:179)

at com.niku.tools.taskdefs.setup.AbstractSetupUtil.execute(AbstractSetupUtil.java:145)

at org.apache.tools.ant.UnknownElement.execute(UnknownElement.java:275)

at org.apache.tools.ant.Task.perform(Task.java:364)

... 13 more
--- Nested Exception ---
java.lang.NullPointerException

at com.niku.tools.OrderedProperties.load(OrderedProperties.java:247)

at com.niku.tools.OrderedProperties.load(OrderedProperties.java:202)

at com.niku.tools.taskdefs.PropertySetupUtil.loadProperties(PropertySetupUtil.java:108)

at com.niku.tools.taskdefs.PropertySetupUtil.getProperties(PropertySetupUtil.java:41)

at com.niku.tools.taskdefs.setup.Query.execute(Query.java:236)

at com.niku.tools.taskdefs.setup.AbstractSetupUtil.processChildren(AbstractSetupUtil.java:179)

at com.niku.tools.taskdefs.setup.AbstractSetupUtil.execute(AbstractSetupUtil.java:145)

at org.apache.tools.ant.UnknownElement.execute(UnknownElement.java:275)

at org.apache.tools.ant.Task.perform(Task.java:364)

at com.niku.tools.taskdefs.CompleteTask.execute(CompleteTask.java:125)

at org.apache.tools.ant.UnknownElement.execute(UnknownElement.java:275)

at org.apache.tools.ant.Task.perform(Task.java:364)

at org.apache.tools.ant.Target.execute(Target.java:342)

at org.apache.tools.ant.Target.performTasks(Target.java:370)

at org.apache.tools.ant.Project.executeSortedTargets(Project.java:1216)

at org.apache.tools.ant.Project.executeTarget(Project.java:1185)

at org.apache.tools.ant.helper.DefaultExecutor.executeTargets(DefaultExecutor.java:40)

at org.apache.tools.ant.Project.executeTargets(Project.java:1068)

at org.apache.tools.ant.Main.runBuild(Main.java:675)

at org.apache.tools.ant.Main.startAnt(Main.java:190)

at org.apache.tools.ant.launch.Launcher.run(Launcher.java:246)

at org.apache.tools.ant.launch.Launcher.main(Launcher.java:67)

BUILD FAILED

D:\NIKU\Install\PMO_2.2\install.xml:37: java.lang.NullPointerException

at org.apache.tools.ant.Task.perform(Task.java:373)

at com.niku.tools.taskdefs.CompleteTask.execute(CompleteTask.java:125)

at org.apache.tools.ant.UnknownElement.execute(UnknownElement.java:275)

at org.apache.tools.ant.Task.perform(Task.java:364)

at org.apache.tools.ant.Target.execute(Target.java:342)

at org.apache.tools.ant.Target.performTasks(Target.java:370)

at org.apache.tools.ant.Project.executeSortedTargets(Project.java:1216)

at org.apache.tools.ant.Project.executeTarget(Project.java:1185)

at org.apache.tools.ant.helper.DefaultExecutor.executeTargets(DefaultExecutor.java:40)

at org.apache.tools.ant.Project.executeTargets(Project.java:1068)

at org.apache.tools.ant.Main.runBuild(Main.java:675)

at org.apache.tools.ant.Main.startAnt(Main.java:190)

at org.apache.tools.ant.launch.Launcher.run(Launcher.java:246)

at org.apache.tools.ant.launch.Launcher.main(Launcher.java:67)
Caused by: java.lang.NullPointerException

at com.niku.tools.OrderedProperties.load(OrderedProperties.java:247)

at com.niku.tools.OrderedProperties.load(OrderedProperties.java:202)

at com.niku.tools.taskdefs.PropertySetupUtil.loadProperties(PropertySetupUtil.java:108)

at com.niku.tools.taskdefs.PropertySetupUtil.getProperties(PropertySetupUtil.java:41)

at com.niku.tools.taskdefs.setup.Query.execute(Query.java:236)

at com.niku.tools.taskdefs.setup.AbstractSetupUtil.processChildren(AbstractSetupUtil.java:179)

at com.niku.tools.taskdefs.setup.AbstractSetupUtil.execute(AbstractSetupUtil.java:145)

at org.apache.tools.ant.UnknownElement.execute(UnknownElement.java:275)

at org.apache.tools.ant.Task.perform(Task.java:364)

... 13 more
--- Nested Exception ---
java.lang.NullPointerException

at com.niku.tools.OrderedProperties.load(OrderedProperties.java:247)

at com.niku.tools.OrderedProperties.load(OrderedProperties.java:202)

at com.niku.tools.taskdefs.PropertySetupUtil.loadProperties(PropertySetupUtil.java:108)

at com.niku.tools.taskdefs.PropertySetupUtil.getProperties(PropertySetupUtil.java:41)

at com.niku.tools.taskdefs.setup.Query.execute(Query.java:236)

at com.niku.tools.taskdefs.setup.AbstractSetupUtil.processChildren(AbstractSetupUtil.java:179)

at com.niku.tools.taskdefs.setup.AbstractSetupUtil.execute(AbstractSetupUtil.java:145)

at org.apache.tools.ant.UnknownElement.execute(UnknownElement.java:275)

at org.apache.tools.ant.Task.perform(Task.java:364)

at com.niku.tools.taskdefs.CompleteTask.execute(CompleteTask.java:125)

at org.apache.tools.ant.UnknownElement.execute(UnknownElement.java:275)

at org.apache.tools.ant.Task.perform(Task.java:364)

at org.apache.tools.ant.Target.execute(Target.java:342)

at org.apache.tools.ant.Target.performTasks(Target.java:370)

at org.apache.tools.ant.Project.executeSortedTargets(Project.java:1216)

at org.apache.tools.ant.Project.executeTarget(Project.java:1185)

at org.apache.tools.ant.helper.DefaultExecutor.executeTargets(DefaultExecutor.java:40)

at org.apache.tools.ant.Project.executeTargets(Project.java:1068)

at org.apache.tools.ant.Main.runBuild(Main.java:675)

at org.apache.tools.ant.Main.startAnt(Main.java:190)

at org.apache.tools.ant.launch.Launcher.run(Launcher.java:246)

at org.apache.tools.ant.launch.Launcher.main(Launcher.java:67)

BUILD FAILED

D:\NIKU\Install\PMO_2.2\install.xml:37: java.lang.NullPointerException

at org.apache.tools.ant.Task.perform(Task.java:373)

at com.niku.tools.taskdefs.CompleteTask.execute(CompleteTask.java:125)

at org.apache.tools.ant.UnknownElement.execute(UnknownElement.java:275)

at org.apache.tools.ant.Task.perform(Task.java:364)

at org.apache.tools.ant.Target.execute(Target.java:342)

at org.apache.tools.ant.Target.performTasks(Target.java:370)

at org.apache.tools.ant.Project.executeSortedTargets(Project.java:1216)

at org.apache.tools.ant.Project.executeTarget(Project.java:1185)

at org.apache.tools.ant.helper.DefaultExecutor.executeTargets(DefaultExecutor.java:40)

at org.apache.tools.ant.Project.executeTargets(Project.java:1068)

at org.apache.tools.ant.Main.runBuild(Main.java:675)

at org.apache.tools.ant.Main.startAnt(Main.java:190)

at org.apache.tools.ant.launch.Launcher.run(Launcher.java:246)

at org.apache.tools.ant.launch.Launcher.main(Launcher.java:67)
Caused by: java.lang.NullPointerException

at com.niku.tools.OrderedProperties.load(OrderedProperties.java:247)

at com.niku.tools.OrderedProperties.load(OrderedProperties.java:202)

at com.niku.tools.taskdefs.PropertySetupUtil.loadProperties(PropertySetupUtil.java:108)

at com.niku.tools.taskdefs.PropertySetupUtil.getProperties(PropertySetupUtil.java:41)

at com.niku.tools.taskdefs.setup.Query.execute(Query.java:236)

at com.niku.tools.taskdefs.setup.AbstractSetupUtil.processChildren(AbstractSetupUtil.java:179)

at com.niku.tools.taskdefs.setup.AbstractSetupUtil.execute(AbstractSetupUtil.java:145)

at org.apache.tools.ant.UnknownElement.execute(UnknownElement.java:275)

at org.apache.tools.ant.Task.perform(Task.java:364)

... 13 more
--- Nested Exception ---
java.lang.NullPointerException

at com.niku.tools.OrderedProperties.load(OrderedProperties.java:247)

at com.niku.tools.OrderedProperties.load(OrderedProperties.java:202)

at com.niku.tools.taskdefs.PropertySetupUtil.loadProperties(PropertySetupUtil.java:108)

at com.niku.tools.taskdefs.PropertySetupUtil.getProperties(PropertySetupUtil.java:41)

at com.niku.tools.taskdefs.setup.Query.execute(Query.java:236)

at com.niku.tools.taskdefs.setup.AbstractSetupUtil.processChildren(AbstractSetupUtil.java:179)

at com.niku.tools.taskdefs.setup.AbstractSetupUtil.execute(AbstractSetupUtil.java:145)

at org.apache.tools.ant.UnknownElement.execute(UnknownElement.java:275)

at org.apache.tools.ant.Task.perform(Task.java:364)

at com.niku.tools.taskdefs.CompleteTask.execute(CompleteTask.java:125)

at org.apache.tools.ant.UnknownElement.execute(UnknownElement.java:275)

at org.apache.tools.ant.Task.perform(Task.java:364)

at org.apache.tools.ant.Target.execute(Target.java:342)

at org.apache.tools.ant.Target.performTasks(Target.java:370)

at org.apache.tools.ant.Project.executeSortedTargets(Project.java:1216)

at org.apache.tools.ant.Project.executeTarget(Project.java:1185)

at org.apache.tools.ant.helper.DefaultExecutor.executeTargets(DefaultExecutor.java:40)

at org.apache.tools.ant.Project.executeTargets(Project.java:1068)

at org.apache.tools.ant.Main.runBuild(Main.java:675)

at org.apache.tools.ant.Main.startAnt(Main.java:190)

at org.apache.tools.ant.launch.Launcher.run(Launcher.java:246)

at org.apache.tools.ant.launch.Launcher.main(Launcher.java:67)
[echo]
-------------------------------------------------------------
MADE IT HERE
-------------------------------------------------------------


BUILD FAILED

D:\NIKU\Install\PMO_2.2\install.xml:42: java.lang.NullPointerException

at org.apache.tools.ant.Task.perform(Task.java:373)

at com.niku.tools.taskdefs.CompleteTask.execute(CompleteTask.java:125)

at org.apache.tools.ant.UnknownElement.execute(UnknownElement.java:275)

at org.apache.tools.ant.Task.perform(Task.java:364)

at org.apache.tools.ant.Target.execute(Target.java:342)

at org.apache.tools.ant.Target.performTasks(Target.java:370)

at org.apache.tools.ant.Project.executeSortedTargets(Project.java:1216)

at org.apache.tools.ant.Project.executeTarget(Project.java:1185)

at org.apache.tools.ant.helper.DefaultExecutor.executeTargets(DefaultExecutor.java:40)

at org.apache.tools.ant.Project.executeTargets(Project.java:1068)

at org.apache.tools.ant.Main.runBuild(Main.java:675)

at org.apache.tools.ant.Main.startAnt(Main.java:190)

at org.apache.tools.ant.launch.Launcher.run(Launcher.java:246)

at org.apache.tools.ant.launch.Launcher.main(Launcher.java:67)
Caused by: java.lang.NullPointerException

at com.niku.tools.OrderedProperties.load(OrderedProperties.java:247)

at com.niku.tools.OrderedProperties.load(OrderedProperties.java:202)

at com.niku.tools.taskdefs.PropertySetupUtil.loadProperties(PropertySetupUtil.java:108)

at com.niku.tools.taskdefs.PropertySetupUtil.getProperties(PropertySetupUtil.java:41)

at com.niku.tools.taskdefs.setup.Query.execute(Query.java:236)

at com.niku.tools.taskdefs.setup.AbstractSetupUtil.processChildren(AbstractSetupUtil.java:179)

at com.niku.tools.taskdefs.setup.AbstractSetupUtil.execute(AbstractSetupUtil.java:145)

at org.apache.tools.ant.UnknownElement.execute(UnknownElement.java:275)

at org.apache.tools.ant.Task.perform(Task.java:364)

... 13 more
--- Nested Exception ---
java.lang.NullPointerException

at com.niku.tools.OrderedProperties.load(OrderedProperties.java:247)

at com.niku.tools.OrderedProperties.load(OrderedProperties.java:202)

at com.niku.tools.taskdefs.PropertySetupUtil.loadProperties(PropertySetupUtil.java:108)

at com.niku.tools.taskdefs.PropertySetupUtil.getProperties(PropertySetupUtil.java:41)

at com.niku.tools.taskdefs.setup.Query.execute(Query.java:236)

at com.niku.tools.taskdefs.setup.AbstractSetupUtil.processChildren(AbstractSetupUtil.java:179)

at com.niku.tools.taskdefs.setup.AbstractSetupUtil.execute(AbstractSetupUtil.java:145)

at org.apache.tools.ant.UnknownElement.execute(UnknownElement.java:275)

at org.apache.tools.ant.Task.perform(Task.java:364)

at com.niku.tools.taskdefs.CompleteTask.execute(CompleteTask.java:125)

at org.apache.tools.ant.UnknownElement.execute(UnknownElement.java:275)

at org.apache.tools.ant.Task.perform(Task.java:364)

at org.apache.tools.ant.Target.execute(Target.java:342)

at org.apache.tools.ant.Target.performTasks(Target.java:370)

at org.apache.tools.ant.Project.executeSortedTargets(Project.java:1216)

at org.apache.tools.ant.Project.executeTarget(Project.java:1185)

at org.apache.tools.ant.helper.DefaultExecutor.executeTargets(DefaultExecutor.java:40)

at org.apache.tools.ant.Project.executeTargets(Project.java:1068)

at org.apache.tools.ant.Main.runBuild(Main.java:675)

at org.apache.tools.ant.Main.startAnt(Main.java:190)

at org.apache.tools.ant.launch.Launcher.run(Launcher.java:246)

at org.apache.tools.ant.launch.Launcher.main(Launcher.java:67)
[echo]
-------------------------------------------------------------
MADE IT HERE
-------------------------------------------------------------


BUILD FAILED

D:\NIKU\Install\PMO_2.2\install.xml:42: The <setuputil> type doesn't support the nested "echo" element.

at org.apache.tools.ant.IntrospectionHelper.throwNotSupported(IntrospectionHelper.java:463)

at org.apache.tools.ant.UnknownElement.handleChildren(UnknownElement.java:329)

at org.apache.tools.ant.UnknownElement.configure(UnknownElement.java:182)

at org.apache.tools.ant.UnknownElement.maybeConfigure(UnknownElement.java:158)

at org.apache.tools.ant.Task.perform(Task.java:363)

at com.niku.tools.taskdefs.CompleteTask.execute(CompleteTask.java:125)

at org.apache.tools.ant.UnknownElement.execute(UnknownElement.java:275)

at org.apache.tools.ant.Task.perform(Task.java:364)

at org.apache.tools.ant.Target.execute(Target.java:342)

at org.apache.tools.ant.Target.performTasks(Target.java:370)

at org.apache.tools.ant.Project.executeSortedTargets(Project.java:1216)

at org.apache.tools.ant.Project.executeTarget(Project.java:1185)

at org.apache.tools.ant.helper.DefaultExecutor.executeTargets(DefaultExecutor.java:40)

at org.apache.tools.ant.Project.executeTargets(Project.java:1068)

at org.apache.tools.ant.Main.runBuild(Main.java:675)

at org.apache.tools.ant.Main.startAnt(Main.java:190)

at org.apache.tools.ant.launch.Launcher.run(Launcher.java:246)

at org.apache.tools.ant.launch.Launcher.main(Launcher.java:67)
[echo]
-------------------------------------------------------------
MADE IT HERE
-------------------------------------------------------------

[echo]
-------------------------------------------------------------
MADE IT HERE2
-------------------------------------------------------------


BUILD FAILED

D:\NIKU\Install\PMO_2.2\install.xml:47: java.lang.NullPointerException

at org.apache.tools.ant.Task.perform(Task.java:373)

at com.niku.tools.taskdefs.CompleteTask.execute(CompleteTask.java:125)

at org.apache.tools.ant.UnknownElement.execute(UnknownElement.java:275)

at org.apache.tools.ant.Task.perform(Task.java:364)

at org.apache.tools.ant.Target.execute(Target.java:342)

at org.apache.tools.ant.Target.performTasks(Target.java:370)

at org.apache.tools.ant.Project.executeSortedTargets(Project.java:1216)

at org.apache.tools.ant.Project.executeTarget(Project.java:1185)

at org.apache.tools.ant.helper.DefaultExecutor.executeTargets(DefaultExecutor.java:40)

at org.apache.tools.ant.Project.executeTargets(Project.java:1068)

at org.apache.tools.ant.Main.runBuild(Main.java:675)

at org.apache.tools.ant.Main.startAnt(Main.java:190)

at org.apache.tools.ant.launch.Launcher.run(Launcher.java:246)

at org.apache.tools.ant.launch.Launcher.main(Launcher.java:67)
Caused by: java.lang.NullPointerException

at com.niku.tools.OrderedProperties.load(OrderedProperties.java:247)

at com.niku.tools.OrderedProperties.load(OrderedProperties.java:202)

at com.niku.tools.taskdefs.PropertySetupUtil.loadProperties(PropertySetupUtil.java:108)

at com.niku.tools.taskdefs.PropertySetupUtil.getProperties(PropertySetupUtil.java:41)

at com.niku.tools.taskdefs.setup.Query.execute(Query.java:236)

at com.niku.tools.taskdefs.setup.AbstractSetupUtil.processChildren(AbstractSetupUtil.java:179)

at com.niku.tools.taskdefs.setup.AbstractSetupUtil.execute(AbstractSetupUtil.java:145)

at org.apache.tools.ant.UnknownElement.execute(UnknownElement.java:275)

at org.apache.tools.ant.Task.perform(Task.java:364)

... 13 more
--- Nested Exception ---
java.lang.NullPointerException

at com.niku.tools.OrderedProperties.load(OrderedProperties.java:247)

at com.niku.tools.OrderedProperties.load(OrderedProperties.java:202)

at com.niku.tools.taskdefs.PropertySetupUtil.loadProperties(PropertySetupUtil.java:108)

at com.niku.tools.taskdefs.PropertySetupUtil.getProperties(PropertySetupUtil.java:41)

at com.niku.tools.taskdefs.setup.Query.execute(Query.java:236)

at com.niku.tools.taskdefs.setup.AbstractSetupUtil.processChildren(AbstractSetupUtil.java:179)

at com.niku.tools.taskdefs.setup.AbstractSetupUtil.execute(AbstractSetupUtil.java:145)

at org.apache.tools.ant.UnknownElement.execute(UnknownElement.java:275)

at org.apache.tools.ant.Task.perform(Task.java:364)

at com.niku.tools.taskdefs.CompleteTask.execute(CompleteTask.java:125)

at org.apache.tools.ant.UnknownElement.execute(UnknownElement.java:275)

at org.apache.tools.ant.Task.perform(Task.java:364)

at org.apache.tools.ant.Target.execute(Target.java:342)

at org.apache.tools.ant.Target.performTasks(Target.java:370)

at org.apache.tools.ant.Project.executeSortedTargets(Project.java:1216)

at org.apache.tools.ant.Project.executeTarget(Project.java:1185)

at org.apache.tools.ant.helper.DefaultExecutor.executeTargets(DefaultExecutor.java:40)

at org.apache.tools.ant.Project.executeTargets(Project.java:1068)

at org.apache.tools.ant.Main.runBuild(Main.java:675)

at org.apache.tools.ant.Main.startAnt(Main.java:190)

at org.apache.tools.ant.launch.Launcher.run(Launcher.java:246)

at org.apache.tools.ant.launch.Launcher.main(Launcher.java:67)
[echo]
-------------------------------------------------------------
MADE IT HERE
-------------------------------------------------------------

[echo]
-------------------------------------------------------------
MADE IT HERE2
-------------------------------------------------------------

[echo]
-------------------------------------------------------------
This program will install package csk:

See the included README.txt for more information.
-------------------------------------------------------------

[echo] Package installation cancelled.

BUILD SUCCESSFUL
[echo]
-------------------------------------------------------------
MADE IT HERE
-------------------------------------------------------------

[echo]
-------------------------------------------------------------
MADE IT HERE2
-------------------------------------------------------------

[echo]
-------------------------------------------------------------
This program will install package csk:

See the included README.txt for more information.
-------------------------------------------------------------


_install:
[echo]

init:

install:
[echo]
-------------------------------------------------------------
This program will install the PMO Accelerator

Version: 2.2.0

Warning:

* The PMO Accelerator cannot
be automatically uninstalled.

* The PMO Accelerator sample data,
which can be installed separately,
is intended for demonstration
purposes only and should not be
installed to a production server.
There is no mechanism for
uninstalling the sample data.

* This PMO Accelerator
update must be applied against
Clarity version 12.1.0 or higher.

* Review the Read Me file prior to installation.
-------------------------------------------------------------

[echo]

init:

files:

pack-config:

remove-attribute:
[echo] Removing obj_alignment attribute...
[java] Attribute with the given specifications {ext_type=formula, attribute=obj_alignment, object=inv, type=number} not found. No removal necessary.

protect-view:
[echo] Getting view information...
[java] Starting view protection
[java] Completed view protection

deploy:
[exec] Content Pack csk version 8.1.0.4247 has been deployed
[exec] Installing content... csk
[exec] Installing content items that do not already exist or have the force option set to true
[exec] ==========================================
[exec] DBTools Log - Thu Mar 29 08:36:34 CDT 2012
[exec] ==========================================
[exec]
[exec] Command: install database schema from driver file
[exec] To URL: jdbc:clarity:sqlserver://ndcmsqld03:1433;DatabaseName=niku;InsensitiveResultSetBufferSize=0;ProgramName=Clarity
[exec] As user: Niku
[exec] For vendor: mssql
[exec] Loading DBDriver file: d:\NIKU\Clarity\database\content\csk\preupgrade-driver.xml
[exec] Loading DBDriver file: d:\NIKU\Clarity\database\content\csk\preupgrade-driver.xml
[exec] Current database version is database_csk_2.2.0.0007-preupgrade
[exec] DBDriver for database_csk_2.2.0.0007-preupgrade
[exec] DBDriver has already been installed!
[exec]
[exec] Total time: 0H:0M:1S
[exec] - Initializing: pma.init...
[exec] SYS 2012-03-29 08:36:36,007 [main] niku.union Initializing: pma.init...

BUILD FAILED

D:\NIKU\Install\PMO_2.2\install.xml:68: The following error occurred while executing this line:
D:\NIKU\Install\PMO_2.2\install.xml:83: The following error occurred while executing this line:
D:\NIKU\Install\PMO_2.2\package\install.xml:135: The following error occurred while executing this line:
D:\NIKU\Install\PMO_2.2\package\install.xml:271: exec returned: 2

at org.apache.tools.ant.ProjectHelper.addLocationToBuildException(ProjectHelper.java:539)

at org.apache.tools.ant.taskdefs.Ant.execute(Ant.java:384)

at org.apache.tools.ant.taskdefs.CallTarget.execute(CallTarget.java:107)

at com.niku.tools.taskdefs.IfTask.execute(IfTask.java:209)

at org.apache.tools.ant.Task.perform(Task.java:364)

at com.niku.tools.taskdefs.ChooseTask.execute(ChooseTask.java:132)

at org.apache.tools.ant.UnknownElement.execute(UnknownElement.java:275)

at org.apache.tools.ant.Task.perform(Task.java:364)

at com.niku.tools.taskdefs.IfTask.execute(IfTask.java:204)

at org.apache.tools.ant.Task.perform(Task.java:364)

at com.niku.tools.taskdefs.ChooseTask.execute(ChooseTask.java:132)

at org.apache.tools.ant.UnknownElement.execute(UnknownElement.java:275)

at org.apache.tools.ant.Task.perform(Task.java:364)

at org.apache.tools.ant.Target.execute(Target.java:342)

at org.apache.tools.ant.Target.performTasks(Target.java:370)

at org.apache.tools.ant.Project.executeSortedTargets(Project.java:1216)

at org.apache.tools.ant.Project.executeTarget(Project.java:1185)

at org.apache.tools.ant.helper.DefaultExecutor.executeTargets(DefaultExecutor.java:40)

at org.apache.tools.ant.Project.executeTargets(Project.java:1068)

at org.apache.tools.ant.Main.runBuild(Main.java:675)

at org.apache.tools.ant.Main.startAnt(Main.java:190)

at org.apache.tools.ant.launch.Launcher.run(Launcher.java:246)

at org.apache.tools.ant.launch.Launcher.main(Launcher.java:67)
Caused by: D:\NIKU\Install\PMO_2.2\install.xml:83: The following error occurred while executing this line:
D:\NIKU\Install\PMO_2.2\package\install.xml:135: The following error occurred while executing this line:
D:\NIKU\Install\PMO_2.2\package\install.xml:271: exec returned: 2

at org.apache.tools.ant.ProjectHelper.addLocationToBuildException(ProjectHelper.java:539)

at org.apache.tools.ant.taskdefs.Ant.execute(Ant.java:384)

at org.apache.tools.ant.UnknownElement.execute(UnknownElement.java:275)

at org.apache.tools.ant.Task.perform(Task.java:364)

at org.apache.tools.ant.Target.execute(Target.java:342)

at org.apache.tools.ant.Target.performTasks(Target.java:370)

at org.apache.tools.ant.Project.executeSortedTargets(Project.java:1216)

at org.apache.tools.ant.helper.SingleCheckExecutor.executeTargets(SingleCheckExecutor.java:37)

at org.apache.tools.ant.Project.executeTargets(Project.java:1068)

at org.apache.tools.ant.taskdefs.Ant.execute(Ant.java:382)

... 21 more
Caused by: D:\NIKU\Install\PMO_2.2\package\install.xml:135: The following error occurred while executing this line:
D:\NIKU\Install\PMO_2.2\package\install.xml:271: exec returned: 2

at org.apache.tools.ant.ProjectHelper.addLocationToBuildException(ProjectHelper.java:539)

at org.apache.tools.ant.taskdefs.Ant.execute(Ant.java:384)

at org.apache.tools.ant.taskdefs.CallTarget.execute(CallTarget.java:107)

at com.niku.tools.taskdefs.IfTask.execute(IfTask.java:209)

at org.apache.tools.ant.Task.perform(Task.java:364)

at com.niku.tools.taskdefs.ChooseTask.execute(ChooseTask.java:132)

at org.apache.tools.ant.UnknownElement.execute(UnknownElement.java:275)

at org.apache.tools.ant.Task.perform(Task.java:364)

at org.apache.tools.ant.Target.execute(Target.java:342)

at org.apache.tools.ant.Target.performTasks(Target.java:370)

at org.apache.tools.ant.Project.executeSortedTargets(Project.java:1216)

at org.apache.tools.ant.helper.SingleCheckExecutor.executeTargets(SingleCheckExecutor.java:37)

at org.apache.tools.ant.Project.executeTargets(Project.java:1068)

at org.apache.tools.ant.taskdefs.Ant.execute(Ant.java:382)

... 29 more
Caused by: D:\NIKU\Install\PMO_2.2\package\install.xml:271: exec returned: 2

at org.apache.tools.ant.taskdefs.ExecTask.runExecute(ExecTask.java:591)

at org.apache.tools.ant.taskdefs.ExecTask.runExec(ExecTask.java:617)

at org.apache.tools.ant.taskdefs.ExecTask.execute(ExecTask.java:452)

at org.apache.tools.ant.UnknownElement.execute(UnknownElement.java:275)

at org.apache.tools.ant.Task.perform(Task.java:364)

at org.apache.tools.ant.Target.execute(Target.java:342)

at org.apache.tools.ant.Target.performTasks(Target.java:370)

at org.apache.tools.ant.Project.executeSortedTargets(Project.java:1216)

at org.apache.tools.ant.helper.SingleCheckExecutor.executeTargets(SingleCheckExecutor.java:37)

at org.apache.tools.ant.Project.executeTargets(Project.java:1068)

at org.apache.tools.ant.taskdefs.Ant.execute(Ant.java:382)

... 41 more
--- Nested Exception ---
D:\NIKU\Install\PMO_2.2\install.xml:83: The following error occurred while executing this line:
D:\NIKU\Install\PMO_2.2\package\install.xml:135: The following error occurred while executing this line:
D:\NIKU\Install\PMO_2.2\package\install.xml:271: exec returned: 2

at org.apache.tools.ant.ProjectHelper.addLocationToBuildException(ProjectHelper.java:539)

at org.apache.tools.ant.taskdefs.Ant.execute(Ant.java:384)

at org.apache.tools.ant.UnknownElement.execute(UnknownElement.java:275)

at org.apache.tools.ant.Task.perform(Task.java:364)

at org.apache.tools.ant.Target.execute(Target.java:342)

at org.apache.tools.ant.Target.performTasks(Target.java:370)

at org.apache.tools.ant.Project.executeSortedTargets(Project.java:1216)

at org.apache.tools.ant.helper.SingleCheckExecutor.executeTargets(SingleCheckExecutor.java:37)

at org.apache.tools.ant.Project.executeTargets(Project.java:1068)

at org.apache.tools.ant.taskdefs.Ant.execute(Ant.java:382)

at org.apache.tools.ant.taskdefs.CallTarget.execute(CallTarget.java:107)

at com.niku.tools.taskdefs.IfTask.execute(IfTask.java:209)

at org.apache.tools.ant.Task.perform(Task.java:364)

at com.niku.tools.taskdefs.ChooseTask.execute(ChooseTask.java:132)

at org.apache.tools.ant.UnknownElement.execute(UnknownElement.java:275)

at org.apache.tools.ant.Task.perform(Task.java:364)

at com.niku.tools.taskdefs.IfTask.execute(IfTask.java:204)

at org.apache.tools.ant.Task.perform(Task.java:364)

at com.niku.tools.taskdefs.ChooseTask.execute(ChooseTask.java:132)

at org.apache.tools.ant.UnknownElement.execute(UnknownElement.java:275)

at org.apache.tools.ant.Task.perform(Task.java:364)

at org.apache.tools.ant.Target.execute(Target.java:342)

at org.apache.tools.ant.Target.performTasks(Target.java:370)

at org.apache.tools.ant.Project.executeSortedTargets(Project.java:1216)

at org.apache.tools.ant.Project.executeTarget(Project.java:1185)

at org.apache.tools.ant.helper.DefaultExecutor.executeTargets(DefaultExecutor.java:40)

at org.apache.tools.ant.Project.executeTargets(Project.java:1068)

at org.apache.tools.ant.Main.runBuild(Main.java:675)

at org.apache.tools.ant.Main.startAnt(Main.java:190)

at org.apache.tools.ant.launch.Launcher.run(Launcher.java:246)

at org.apache.tools.ant.launch.Launcher.main(Launcher.java:67)
Caused by: D:\NIKU\Install\PMO_2.2\package\install.xml:135: The following error occurred while executing this line:
D:\NIKU\Install\PMO_2.2\package\install.xml:271: exec returned: 2

at org.apache.tools.ant.ProjectHelper.addLocationToBuildException(ProjectHelper.java:539)

at org.apache.tools.ant.taskdefs.Ant.execute(Ant.java:384)

at org.apache.tools.ant.taskdefs.CallTarget.execute(CallTarget.java:107)

at com.niku.tools.taskdefs.IfTask.execute(IfTask.java:209)

at org.apache.tools.ant.Task.perform(Task.java:364)

at com.niku.tools.taskdefs.ChooseTask.execute(ChooseTask.java:132)

at org.apache.tools.ant.UnknownElement.execute(UnknownElement.java:275)

at org.apache.tools.ant.Task.perform(Task.java:364)

at org.apache.tools.ant.Target.execute(Target.java:342)

at org.apache.tools.ant.Target.performTasks(Target.java:370)

at org.apache.tools.ant.Project.executeSortedTargets(Project.java:1216)

at org.apache.tools.ant.helper.SingleCheckExecutor.executeTargets(SingleCheckExecutor.java:37)

at org.apache.tools.ant.Project.executeTargets(Project.java:1068)

at org.apache.tools.ant.taskdefs.Ant.execute(Ant.java:382)

... 29 more
Caused by: D:\NIKU\Install\PMO_2.2\package\install.xml:271: exec returned: 2

at org.apache.tools.ant.taskdefs.ExecTask.runExecute(ExecTask.java:591)

at org.apache.tools.ant.taskdefs.ExecTask.runExec(ExecTask.java:617)

at org.apache.tools.ant.taskdefs.ExecTask.execute(ExecTask.java:452)

at org.apache.tools.ant.UnknownElement.execute(UnknownElement.java:275)

at org.apache.tools.ant.Task.perform(Task.java:364)

at org.apache.tools.ant.Target.execute(Target.java:342)

at org.apache.tools.ant.Target.performTasks(Target.java:370)

at org.apache.tools.ant.Project.executeSortedTargets(Project.java:1216)

at org.apache.tools.ant.helper.SingleCheckExecutor.executeTargets(SingleCheckExecutor.java:37)

at org.apache.tools.ant.Project.executeTargets(Project.java:1068)

at org.apache.tools.ant.taskdefs.Ant.execute(Ant.java:382)

... 41 more
--- Nested Exception ---
D:\NIKU\Install\PMO_2.2\package\install.xml:135: The following error occurred while executing this line:
D:\NIKU\Install\PMO_2.2\package\install.xml:271: exec returned: 2

at org.apache.tools.ant.ProjectHelper.addLocationToBuildException(ProjectHelper.java:539)

at org.apache.tools.ant.taskdefs.Ant.execute(Ant.java:384)

at org.apache.tools.ant.taskdefs.CallTarget.execute(CallTarget.java:107)

at com.niku.tools.taskdefs.IfTask.execute(IfTask.java:209)

at org.apache.tools.ant.Task.perform(Task.java:364)

at com.niku.tools.taskdefs.ChooseTask.execute(ChooseTask.java:132)

at org.apache.tools.ant.UnknownElement.execute(UnknownElement.java:275)

at org.apache.tools.ant.Task.perform(Task.java:364)

at org.apache.tools.ant.Target.execute(Target.java:342)

at org.apache.tools.ant.Target.performTasks(Target.java:370)

at org.apache.tools.ant.Project.executeSortedTargets(Project.java:1216)

at org.apache.tools.ant.helper.SingleCheckExecutor.executeTargets(SingleCheckExecutor.java:37)

at org.apache.tools.ant.Project.executeTargets(Project.java:1068)

at org.apache.tools.ant.taskdefs.Ant.execute(Ant.java:382)

at org.apache.tools.ant.UnknownElement.execute(UnknownElement.java:275)

at org.apache.tools.ant.Task.perform(Task.java:364)

at org.apache.tools.ant.Target.execute(Target.java:342)

at org.apache.tools.ant.Target.performTasks(Target.java:370)

at org.apache.tools.ant.Project.executeSortedTargets(Project.java:1216)

at org.apache.tools.ant.helper.SingleCheckExecutor.executeTargets(SingleCheckExecutor.java:37)

at org.apache.tools.ant.Project.executeTargets(Project.java:1068)

at org.apache.tools.ant.taskdefs.Ant.execute(Ant.java:382)

at org.apache.tools.ant.taskdefs.CallTarget.execute(CallTarget.java:107)

at com.niku.tools.taskdefs.IfTask.execute(IfTask.java:209)

at org.apache.tools.ant.Task.perform(Task.java:364)

at com.niku.tools.taskdefs.ChooseTask.execute(ChooseTask.java:132)

at org.apache.tools.ant.UnknownElement.execute(UnknownElement.java:275)

at org.apache.tools.ant.Task.perform(Task.java:364)

at com.niku.tools.taskdefs.IfTask.execute(IfTask.java:204)

at org.apache.tools.ant.Task.perform(Task.java:364)

at com.niku.tools.taskdefs.ChooseTask.execute(ChooseTask.java:132)

at org.apache.tools.ant.UnknownElement.execute(UnknownElement.java:275)

at org.apache.tools.ant.Task.perform(Task.java:364)

at org.apache.tools.ant.Target.execute(Target.java:342)

at org.apache.tools.ant.Target.performTasks(Target.java:370)

at org.apache.tools.ant.Project.executeSortedTargets(Project.java:1216)

at org.apache.tools.ant.Project.executeTarget(Project.java:1185)

at org.apache.tools.ant.helper.DefaultExecutor.executeTargets(DefaultExecutor.java:40)

at org.apache.tools.ant.Project.executeTargets(Project.java:1068)

at org.apache.tools.ant.Main.runBuild(Main.java:675)

at org.apache.tools.ant.Main.startAnt(Main.java:190)

at org.apache.tools.ant.launch.Launcher.run(Launcher.java:246)

at org.apache.tools.ant.launch.Launcher.main(Launcher.java:67)
Caused by: D:\NIKU\Install\PMO_2.2\package\install.xml:271: exec returned: 2

at org.apache.tools.ant.taskdefs.ExecTask.runExecute(ExecTask.java:591)

at org.apache.tools.ant.taskdefs.ExecTask.runExec(ExecTask.java:617)

at org.apache.tools.ant.taskdefs.ExecTask.execute(ExecTask.java:452)

at org.apache.tools.ant.UnknownElement.execute(UnknownElement.java:275)

at org.apache.tools.ant.Task.perform(Task.java:364)

at org.apache.tools.ant.Target.execute(Target.java:342)

at org.apache.tools.ant.Target.performTasks(Target.java:370)

at org.apache.tools.ant.Project.executeSortedTargets(Project.java:1216)

at org.apache.tools.ant.helper.SingleCheckExecutor.executeTargets(SingleCheckExecutor.java:37)

at org.apache.tools.ant.Project.executeTargets(Project.java:1068)

at org.apache.tools.ant.taskdefs.Ant.execute(Ant.java:382)

... 41 more
--- Nested Exception ---
D:\NIKU\Install\PMO_2.2\package\install.xml:271: exec returned: 2

at org.apache.tools.ant.taskdefs.ExecTask.runExecute(ExecTask.java:591)

at org.apache.tools.ant.taskdefs.ExecTask.runExec(ExecTask.java:617)

at org.apache.tools.ant.taskdefs.ExecTask.execute(ExecTask.java:452)

at org.apache.tools.ant.UnknownElement.execute(UnknownElement.java:275)

at org.apache.tools.ant.Task.perform(Task.java:364)

at org.apache.tools.ant.Target.execute(Target.java:342)

at org.apache.tools.ant.Target.performTasks(Target.java:370)

at org.apache.tools.ant.Project.executeSortedTargets(Project.java:1216)

at org.apache.tools.ant.helper.SingleCheckExecutor.executeTargets(SingleCheckExecutor.java:37)

at org.apache.tools.ant.Project.executeTargets(Project.java:1068)

at org.apache.tools.ant.taskdefs.Ant.execute(Ant.java:382)

at org.apache.tools.ant.taskdefs.CallTarget.execute(CallTarget.java:107)

at com.niku.tools.taskdefs.IfTask.execute(IfTask.java:209)

at org.apache.tools.ant.Task.perform(Task.java:364)

at com.niku.tools.taskdefs.ChooseTask.execute(ChooseTask.java:132)

at org.apache.tools.ant.UnknownElement.execute(UnknownElement.java:275)

at org.apache.tools.ant.Task.perform(Task.java:364)

at org.apache.tools.ant.Target.execute(Target.java:342)

at org.apache.tools.ant.Target.performTasks(Target.java:370)

at org.apache.tools.ant.Project.executeSortedTargets(Project.java:1216)

at org.apache.tools.ant.helper.SingleCheckExecutor.executeTargets(SingleCheckExecutor.java:37)

at org.apache.tools.ant.Project.executeTargets(Project.java:1068)

at org.apache.tools.ant.taskdefs.Ant.execute(Ant.java:382)

at org.apache.tools.ant.UnknownElement.execute(UnknownElement.java:275)

at org.apache.tools.ant.Task.perform(Task.java:364)

at org.apache.tools.ant.Target.execute(Target.java:342)

at org.apache.tools.ant.Target.performTasks(Target.java:370)

at org.apache.tools.ant.Project.executeSortedTargets(Project.java:1216)

at org.apache.tools.ant.helper.SingleCheckExecutor.executeTargets(SingleCheckExecutor.java:37)

at org.apache.tools.ant.Project.executeTargets(Project.java:1068)

at org.apache.tools.ant.taskdefs.Ant.execute(Ant.java:382)

at org.apache.tools.ant.taskdefs.CallTarget.execute(CallTarget.java:107)

at com.niku.tools.taskdefs.IfTask.execute(IfTask.java:209)

at org.apache.tools.ant.Task.perform(Task.java:364)

at com.niku.tools.taskdefs.ChooseTask.execute(ChooseTask.java:132)

at org.apache.tools.ant.UnknownElement.execute(UnknownElement.java:275)

at org.apache.tools.ant.Task.perform(Task.java:364)

at com.niku.tools.taskdefs.IfTask.execute(IfTask.java:204)

at org.apache.tools.ant.Task.perform(Task.java:364)

at com.niku.tools.taskdefs.ChooseTask.execute(ChooseTask.java:132)

at org.apache.tools.ant.UnknownElement.execute(UnknownElement.java:275)

at org.apache.tools.ant.Task.perform(Task.java:364)

at org.apache.tools.ant.Target.execute(Target.java:342)

at org.apache.tools.ant.Target.performTasks(Target.java:370)

at org.apache.tools.ant.Project.executeSortedTargets(Project.java:1216)

at org.apache.tools.ant.Project.executeTarget(Project.java:1185)

at org.apache.tools.ant.helper.DefaultExecutor.executeTargets(DefaultExecutor.java:40)

at org.apache.tools.ant.Project.executeTargets(Project.java:1068)

at org.apache.tools.ant.Main.runBuild(Main.java:675)

at org.apache.tools.ant.Main.startAnt(Main.java:190)

at org.apache.tools.ant.launch.Launcher.run(Launcher.java:246)

at org.apache.tools.ant.launch.Launcher.main(Launcher.java:67)
[echo]
-------------------------------------------------------------
MADE IT HERE
-------------------------------------------------------------

[echo]
-------------------------------------------------------------
MADE IT HERE2
-------------------------------------------------------------

[echo]
-------------------------------------------------------------
This program will install package csk:

See the included README.txt for more information.
-------------------------------------------------------------


_install:
[echo]

init:

install:
[echo]
-------------------------------------------------------------
This program will install the PMO Accelerator

Version: 2.2.0

Warning:

* The PMO Accelerator cannot
be automatically uninstalled.

* The PMO Accelerator sample data,
which can be installed separately,
is intended for demonstration
purposes only and should not be
installed to a production server.
There is no mechanism for
uninstalling the sample data.

* This PMO Accelerator
update must be applied against
Clarity version 12.1.0 or higher.

* Review the Read Me file prior to installation.
-------------------------------------------------------------

[echo]

init:

files:

pack-config:

remove-attribute:
[echo] Removing obj_alignment attribute...
[java] Attribute with the given specifications {ext_type=formula, attribute=obj_alignment, object=inv, type=number} not found. No removal necessary.

protect-view:
[echo] Getting view information...
[java] Starting view protection
[java] Completed view protection

deploy:
[exec] Content Pack csk version 8.1.0.4247 has been deployed
[exec] Installing content... csk
[exec] Installing content items that do not already exist or have the force option set to true
[exec] ==========================================
[exec] DBTools Log - Thu Mar 29 08:56:45 CDT 2012
[exec] ==========================================
[exec]
[exec] Command: install database schema from driver file
[exec] To URL: jdbc:clarity:sqlserver://ndcmsqld03:1433;DatabaseName=niku;InsensitiveResultSetBufferSize=0;ProgramName=Clarity
[exec] As user: Niku
[exec] For vendor: mssql
[exec] Loading DBDriver file: d:\NIKU\Clarity\database\content\csk\preupgrade-driver.xml
[exec] Loading DBDriver file: d:\NIKU\Clarity\database\content\csk\preupgrade-driver.xml
[exec] Current database version is database_csk_2.2.0.0007-preupgrade
[exec] DBDriver for database_csk_2.2.0.0007-preupgrade
[exec] DBDriver has already been installed!
[exec]
[exec] Total time: 0H:0M:1S
[exec] - Initializing: pma.init...
[exec] SYS 2012-03-29 08:56:47,234 [main] niku.union Initializing: pma.init...

BUILD FAILED

D:\NIKU\Install\PMO_2.2\install.xml:68: The following error occurred while executing this line:
D:\NIKU\Install\PMO_2.2\install.xml:83: The following error occurred while executing this line:
D:\NIKU\Install\PMO_2.2\package\install.xml:135: The following error occurred while executing this line:
D:\NIKU\Install\PMO_2.2\package\install.xml:271: exec returned: 2

at org.apache.tools.ant.ProjectHelper.addLocationToBuildException(ProjectHelper.java:539)

at org.apache.tools.ant.taskdefs.Ant.execute(Ant.java:384)

at org.apache.tools.ant.taskdefs.CallTarget.execute(CallTarget.java:107)

at com.niku.tools.taskdefs.IfTask.execute(IfTask.java:209)

at org.apache.tools.ant.Task.perform(Task.java:364)

at com.niku.tools.taskdefs.ChooseTask.execute(ChooseTask.java:132)

at org.apache.tools.ant.UnknownElement.execute(UnknownElement.java:275)

at org.apache.tools.ant.Task.perform(Task.java:364)

at com.niku.tools.taskdefs.IfTask.execute(IfTask.java:204)

at org.apache.tools.ant.Task.perform(Task.java:364)

at com.niku.tools.taskdefs.ChooseTask.execute(ChooseTask.java:132)

at org.apache.tools.ant.UnknownElement.execute(UnknownElement.java:275)

at org.apache.tools.ant.Task.perform(Task.java:364)

at org.apache.tools.ant.Target.execute(Target.java:342)

at org.apache.tools.ant.Target.performTasks(Target.java:370)

at org.apache.tools.ant.Project.executeSortedTargets(Project.java:1216)

at org.apache.tools.ant.Project.executeTarget(Project.java:1185)

at org.apache.tools.ant.helper.DefaultExecutor.executeTargets(DefaultExecutor.java:40)

at org.apache.tools.ant.Project.executeTargets(Project.java:1068)

at org.apache.tools.ant.Main.runBuild(Main.java:675)

at org.apache.tools.ant.Main.startAnt(Main.java:190)

at org.apache.tools.ant.launch.Launcher.run(Launcher.java:246)

at org.apache.tools.ant.launch.Launcher.main(Launcher.java:67)
Caused by: D:\NIKU\Install\PMO_2.2\install.xml:83: The following error occurred while executing this line:
D:\NIKU\Install\PMO_2.2\package\install.xml:135: The following error occurred while executing this line:
D:\NIKU\Install\PMO_2.2\package\install.xml:271: exec returned: 2

at org.apache.tools.ant.ProjectHelper.addLocationToBuildException(ProjectHelper.java:539)

at org.apache.tools.ant.taskdefs.Ant.execute(Ant.java:384)

at org.apache.tools.ant.UnknownElement.execute(UnknownElement.java:275)

at org.apache.tools.ant.Task.perform(Task.java:364)

at org.apache.tools.ant.Target.execute(Target.java:342)

at org.apache.tools.ant.Target.performTasks(Target.java:370)

at org.apache.tools.ant.Project.executeSortedTargets(Project.java:1216)

at org.apache.tools.ant.helper.SingleCheckExecutor.executeTargets(SingleCheckExecutor.java:37)

at org.apache.tools.ant.Project.executeTargets(Project.java:1068)

at org.apache.tools.ant.taskdefs.Ant.execute(Ant.java:382)

... 21 more
Caused by: D:\NIKU\Install\PMO_2.2\package\install.xml:135: The following error occurred while executing this line:
D:\NIKU\Install\PMO_2.2\package\install.xml:271: exec returned: 2

at org.apache.tools.ant.ProjectHelper.addLocationToBuildException(ProjectHelper.java:539)

at org.apache.tools.ant.taskdefs.Ant.execute(Ant.java:384)

at org.apache.tools.ant.taskdefs.CallTarget.execute(CallTarget.java:107)

at com.niku.tools.taskdefs.IfTask.execute(IfTask.java:209)

at org.apache.tools.ant.Task.perform(Task.java:364)

at com.niku.tools.taskdefs.ChooseTask.execute(ChooseTask.java:132)

at org.apache.tools.ant.UnknownElement.execute(UnknownElement.java:275)

at org.apache.tools.ant.Task.perform(Task.java:364)

at org.apache.tools.ant.Target.execute(Target.java:342)

at org.apache.tools.ant.Target.performTasks(Target.java:370)

at org.apache.tools.ant.Project.executeSortedTargets(Project.java:1216)

at org.apache.tools.ant.helper.SingleCheckExecutor.executeTargets(SingleCheckExecutor.java:37)

at org.apache.tools.ant.Project.executeTargets(Project.java:1068)

at org.apache.tools.ant.taskdefs.Ant.execute(Ant.java:382)

... 29 more
Caused by: D:\NIKU\Install\PMO_2.2\package\install.xml:271: exec returned: 2

at org.apache.tools.ant.taskdefs.ExecTask.runExecute(ExecTask.java:591)

at org.apache.tools.ant.taskdefs.ExecTask.runExec(ExecTask.java:617)

at org.apache.tools.ant.taskdefs.ExecTask.execute(ExecTask.java:452)

at org.apache.tools.ant.UnknownElement.execute(UnknownElement.java:275)

at org.apache.tools.ant.Task.perform(Task.java:364)

at org.apache.tools.ant.Target.execute(Target.java:342)

at org.apache.tools.ant.Target.performTasks(Target.java:370)

at org.apache.tools.ant.Project.executeSortedTargets(Project.java:1216)

at org.apache.tools.ant.helper.SingleCheckExecutor.executeTargets(SingleCheckExecutor.java:37)

at org.apache.tools.ant.Project.executeTargets(Project.java:1068)

at org.apache.tools.ant.taskdefs.Ant.execute(Ant.java:382)

... 41 more
--- Nested Exception ---
D:\NIKU\Install\PMO_2.2\install.xml:83: The following error occurred while executing this line:
D:\NIKU\Install\PMO_2.2\package\install.xml:135: The following error occurred while executing this line:
D:\NIKU\Install\PMO_2.2\package\install.xml:271: exec returned: 2

at org.apache.tools.ant.ProjectHelper.addLocationToBuildException(ProjectHelper.java:539)

at org.apache.tools.ant.taskdefs.Ant.execute(Ant.java:384)

at org.apache.tools.ant.UnknownElement.execute(UnknownElement.java:275)

at org.apache.tools.ant.Task.perform(Task.java:364)

at org.apache.tools.ant.Target.execute(Target.java:342)

at org.apache.tools.ant.Target.performTasks(Target.java:370)

at org.apache.tools.ant.Project.executeSortedTargets(Project.java:1216)

at org.apache.tools.ant.helper.SingleCheckExecutor.executeTargets(SingleCheckExecutor.java:37)

at org.apache.tools.ant.Project.executeTargets(Project.java:1068)

at org.apache.tools.ant.taskdefs.Ant.execute(Ant.java:382)

at org.apache.tools.ant.taskdefs.CallTarget.execute(CallTarget.java:107)

at com.niku.tools.taskdefs.IfTask.execute(IfTask.java:209)

at org.apache.tools.ant.Task.perform(Task.java:364)

at com.niku.tools.taskdefs.ChooseTask.execute(ChooseTask.java:132)

at org.apache.tools.ant.UnknownElement.execute(UnknownElement.java:275)

at org.apache.tools.ant.Task.perform(Task.java:364)

at com.niku.tools.taskdefs.IfTask.execute(IfTask.java:204)

at org.apache.tools.ant.Task.perform(Task.java:364)

at com.niku.tools.taskdefs.ChooseTask.execute(ChooseTask.java:132)

at org.apache.tools.ant.UnknownElement.execute(UnknownElement.java:275)

at org.apache.tools.ant.Task.perform(Task.java:364)

at org.apache.tools.ant.Target.execute(Target.java:342)

at org.apache.tools.ant.Target.performTasks(Target.java:370)

at org.apache.tools.ant.Project.executeSortedTargets(Project.java:1216)

at org.apache.tools.ant.Project.executeTarget(Project.java:1185)

at org.apache.tools.ant.helper.DefaultExecutor.executeTargets(DefaultExecutor.java:40)

at org.apache.tools.ant.Project.executeTargets(Project.java:1068)

at org.apache.tools.ant.Main.runBuild(Main.java:675)

at org.apache.tools.ant.Main.startAnt(Main.java:190)

at org.apache.tools.ant.launch.Launcher.run(Launcher.java:246)

at org.apache.tools.ant.launch.Launcher.main(Launcher.java:67)
Caused by: D:\NIKU\Install\PMO_2.2\package\install.xml:135: The following error occurred while executing this line:
D:\NIKU\Install\PMO_2.2\package\install.xml:271: exec returned: 2

at org.apache.tools.ant.ProjectHelper.addLocationToBuildException(ProjectHelper.java:539)

at org.apache.tools.ant.taskdefs.Ant.execute(Ant.java:384)

at org.apache.tools.ant.taskdefs.CallTarget.execute(CallTarget.java:107)

at com.niku.tools.taskdefs.IfTask.execute(IfTask.java:209)

at org.apache.tools.ant.Task.perform(Task.java:364)

at com.niku.tools.taskdefs.ChooseTask.execute(ChooseTask.java:132)

at org.apache.tools.ant.UnknownElement.execute(UnknownElement.java:275)

at org.apache.tools.ant.Task.perform(Task.java:364)

at org.apache.tools.ant.Target.execute(Target.java:342)

at org.apache.tools.ant.Target.performTasks(Target.java:370)

at org.apache.tools.ant.Project.executeSortedTargets(Project.java:1216)

at org.apache.tools.ant.helper.SingleCheckExecutor.executeTargets(SingleCheckExecutor.java:37)

at org.apache.tools.ant.Project.executeTargets(Project.java:1068)

at org.apache.tools.ant.taskdefs.Ant.execute(Ant.java:382)

... 29 more
Caused by: D:\NIKU\Install\PMO_2.2\package\install.xml:271: exec returned: 2

at org.apache.tools.ant.taskdefs.ExecTask.runExecute(ExecTask.java:591)

at org.apache.tools.ant.taskdefs.ExecTask.runExec(ExecTask.java:617)

at org.apache.tools.ant.taskdefs.ExecTask.execute(ExecTask.java:452)

at org.apache.tools.ant.UnknownElement.execute(UnknownElement.java:275)

at org.apache.tools.ant.Task.perform(Task.java:364)

at org.apache.tools.ant.Target.execute(Target.java:342)

at org.apache.tools.ant.Target.performTasks(Target.java:370)

at org.apache.tools.ant.Project.executeSortedTargets(Project.java:1216)

at org.apache.tools.ant.helper.SingleCheckExecutor.executeTargets(SingleCheckExecutor.java:37)

at org.apache.tools.ant.Project.executeTargets(Project.java:1068)

at org.apache.tools.ant.taskdefs.Ant.execute(Ant.java:382)

... 41 more
--- Nested Exception ---
D:\NIKU\Install\PMO_2.2\package\install.xml:135: The following error occurred while executing this line:
D:\NIKU\Install\PMO_2.2\package\install.xml:271: exec returned: 2

at org.apache.tools.ant.ProjectHelper.addLocationToBuildException(ProjectHelper.java:539)

at org.apache.tools.ant.taskdefs.Ant.execute(Ant.java:384)

at org.apache.tools.ant.taskdefs.CallTarget.execute(CallTarget.java:107)

at com.niku.tools.taskdefs.IfTask.execute(IfTask.java:209)

at org.apache.tools.ant.Task.perform(Task.java:364)

at com.niku.tools.taskdefs.ChooseTask.execute(ChooseTask.java:132)

at org.apache.tools.ant.UnknownElement.execute(UnknownElement.java:275)

at org.apache.tools.ant.Task.perform(Task.java:364)

at org.apache.tools.ant.Target.execute(Target.java:342)

at org.apache.tools.ant.Target.performTasks(Target.java:370)

at org.apache.tools.ant.Project.executeSortedTargets(Project.java:1216)

at org.apache.tools.ant.helper.SingleCheckExecutor.executeTargets(SingleCheckExecutor.java:37)

at org.apache.tools.ant.Project.executeTargets(Project.java:1068)

at org.apache.tools.ant.taskdefs.Ant.execute(Ant.java:382)

at org.apache.tools.ant.UnknownElement.execute(UnknownElement.java:275)

at org.apache.tools.ant.Task.perform(Task.java:364)

at org.apache.tools.ant.Target.execute(Target.java:342)

at org.apache.tools.ant.Target.performTasks(Target.java:370)

at org.apache.tools.ant.Project.executeSortedTargets(Project.java:1216)

at org.apache.tools.ant.helper.SingleCheckExecutor.executeTargets(SingleCheckExecutor.java:37)

at org.apache.tools.ant.Project.executeTargets(Project.java:1068)

at org.apache.tools.ant.taskdefs.Ant.execute(Ant.java:382)

at org.apache.tools.ant.taskdefs.CallTarget.execute(CallTarget.java:107)

at com.niku.tools.taskdefs.IfTask.execute(IfTask.java:209)

at org.apache.tools.ant.Task.perform(Task.java:364)

at com.niku.tools.taskdefs.ChooseTask.execute(ChooseTask.java:132)

at org.apache.tools.ant.UnknownElement.execute(UnknownElement.java:275)

at org.apache.tools.ant.Task.perform(Task.java:364)

at com.niku.tools.taskdefs.IfTask.execute(IfTask.java:204)

at org.apache.tools.ant.Task.perform(Task.java:364)

at com.niku.tools.taskdefs.ChooseTask.execute(ChooseTask.java:132)

at org.apache.tools.ant.UnknownElement.execute(UnknownElement.java:275)

at org.apache.tools.ant.Task.perform(Task.java:364)

at org.apache.tools.ant.Target.execute(Target.java:342)

at org.apache.tools.ant.Target.performTasks(Target.java:370)

at org.apache.tools.ant.Project.executeSortedTargets(Project.java:1216)

at org.apache.tools.ant.Project.executeTarget(Project.java:1185)

at org.apache.tools.ant.helper.DefaultExecutor.executeTargets(DefaultExecutor.java:40)

at org.apache.tools.ant.Project.executeTargets(Project.java:1068)

at org.apache.tools.ant.Main.runBuild(Main.java:675)

at org.apache.tools.ant.Main.startAnt(Main.java:190)

at org.apache.tools.ant.launch.Launcher.run(Launcher.java:246)

at org.apache.tools.ant.launch.Launcher.main(Launcher.java:67)
Caused by: D:\NIKU\Install\PMO_2.2\package\install.xml:271: exec returned: 2

at org.apache.tools.ant.taskdefs.ExecTask.runExecute(ExecTask.java:591)

at org.apache.tools.ant.taskdefs.ExecTask.runExec(ExecTask.java:617)

at org.apache.tools.ant.taskdefs.ExecTask.execute(ExecTask.java:452)

at org.apache.tools.ant.UnknownElement.execute(UnknownElement.java:275)

at org.apache.tools.ant.Task.perform(Task.java:364)

at org.apache.tools.ant.Target.execute(Target.java:342)

at org.apache.tools.ant.Target.performTasks(Target.java:370)

at org.apache.tools.ant.Project.executeSortedTargets(Project.java:1216)

at org.apache.tools.ant.helper.SingleCheckExecutor.executeTargets(SingleCheckExecutor.java:37)

at org.apache.tools.ant.Project.executeTargets(Project.java:1068)

at org.apache.tools.ant.taskdefs.Ant.execute(Ant.java:382)

... 41 more
--- Nested Exception ---
D:\NIKU\Install\PMO_2.2\package\install.xml:271: exec returned: 2

at org.apache.tools.ant.taskdefs.ExecTask.runExecute(ExecTask.java:591)

at org.apache.tools.ant.taskdefs.ExecTask.runExec(ExecTask.java:617)

at org.apache.tools.ant.taskdefs.ExecTask.execute(ExecTask.java:452)

at org.apache.tools.ant.UnknownElement.execute(UnknownElement.java:275)

at org.apache.tools.ant.Task.perform(Task.java:364)

at org.apache.tools.ant.Target.execute(Target.java:342)

at org.apache.tools.ant.Target.performTasks(Target.java:370)

at org.apache.tools.ant.Project.executeSortedTargets(Project.java:1216)

at org.apache.tools.ant.helper.SingleCheckExecutor.executeTargets(SingleCheckExecutor.java:37)

at org.apache.tools.ant.Project.executeTargets(Project.java:1068)

at org.apache.tools.ant.taskdefs.Ant.execute(Ant.java:382)

at org.apache.tools.ant.taskdefs.CallTarget.execute(CallTarget.java:107)

at com.niku.tools.taskdefs.IfTask.execute(IfTask.java:209)

at org.apache.tools.ant.Task.perform(Task.java:364)

at com.niku.tools.taskdefs.ChooseTask.execute(ChooseTask.java:132)

at org.apache.tools.ant.UnknownElement.execute(UnknownElement.java:275)

at org.apache.tools.ant.Task.perform(Task.java:364)

at org.apache.tools.ant.Target.execute(Target.java:342)

at org.apache.tools.ant.Target.performTasks(Target.java:370)

at org.apache.tools.ant.Project.executeSortedTargets(Project.java:1216)

at org.apache.tools.ant.helper.SingleCheckExecutor.executeTargets(SingleCheckExecutor.java:37)

at org.apache.tools.ant.Project.executeTargets(Project.java:1068)

at org.apache.tools.ant.taskdefs.Ant.execute(Ant.java:382)

at org.apache.tools.ant.UnknownElement.execute(UnknownElement.java:275)

at org.apache.tools.ant.Task.perform(Task.java:364)

at org.apache.tools.ant.Target.execute(Target.java:342)

at org.apache.tools.ant.Target.performTasks(Target.java:370)

at org.apache.tools.ant.Project.executeSortedTargets(Project.java:1216)

at org.apache.tools.ant.helper.SingleCheckExecutor.executeTargets(SingleCheckExecutor.java:37)

at org.apache.tools.ant.Project.executeTargets(Project.java:1068)

at org.apache.tools.ant.taskdefs.Ant.execute(Ant.java:382)

at org.apache.tools.ant.taskdefs.CallTarget.execute(CallTarget.java:107)

at com.niku.tools.taskdefs.IfTask.execute(IfTask.java:209)

at org.apache.tools.ant.Task.perform(Task.java:364)

at com.niku.tools.taskdefs.ChooseTask.execute(ChooseTask.java:132)

at org.apache.tools.ant.UnknownElement.execute(UnknownElement.java:275)

at org.apache.tools.ant.Task.perform(Task.java:364)

at com.niku.tools.taskdefs.IfTask.execute(IfTask.java:204)

at org.apache.tools.ant.Task.perform(Task.java:364)

at com.niku.tools.taskdefs.ChooseTask.execute(ChooseTask.java:132)

at org.apache.tools.ant.UnknownElement.execute(UnknownElement.java:275)

at org.apache.tools.ant.Task.perform(Task.java:364)

at org.apache.tools.ant.Target.execute(Target.java:342)

at org.apache.tools.ant.Target.performTasks(Target.java:370)

at org.apache.tools.ant.Project.executeSortedTargets(Project.java:1216)

at org.apache.tools.ant.Project.executeTarget(Project.java:1185)

at org.apache.tools.ant.helper.DefaultExecutor.executeTargets(DefaultExecutor.java:40)

at org.apache.tools.ant.Project.executeTargets(Project.java:1068)

at org.apache.tools.ant.Main.runBuild(Main.java:675)

at org.apache.tools.ant.Main.startAnt(Main.java:190)

at org.apache.tools.ant.launch.Launcher.run(Launcher.java:246)

at org.apache.tools.ant.launch.Launcher.main(Launcher.java:67)
[echo]
-------------------------------------------------------------
MADE IT HERE
-------------------------------------------------------------

[echo]
-------------------------------------------------------------
MADE IT HERE2
-------------------------------------------------------------

[echo]
-------------------------------------------------------------
This program will install package csk:

See the included README.txt for more information.
-------------------------------------------------------------


_install:
[echo]

init:

install:
[echo]
-------------------------------------------------------------
This program will install the PMO Accelerator

Version: 2.2.0

Warning:

* The PMO Accelerator cannot
be automatically uninstalled.

* The PMO Accelerator sample data,
which can be installed separately,
is intended for demonstration
purposes only and should not be
installed to a production server.
There is no mechanism for
uninstalling the sample data.

* This PMO Accelerator
update must be applied against
Clarity version 12.1.0 or higher.

* Review the Read Me file prior to installation.
-------------------------------------------------------------

[echo]

init:

files:

pack-config:

remove-attribute:
[echo] Removing obj_alignment attribute...
[java] Attribute with the given specifications {ext_type=formula, attribute=obj_alignment, object=inv, type=number} not found. No removal necessary.

protect-view:
[echo] Getting view information...
[java] Starting view protection
[java] Completed view protection

deploy:
[exec] Content Pack csk version 8.1.0.4247 has been deployed
[exec] Installing content... csk
[exec] Installing content items that do not already exist or have the force option set to true
[exec] ==========================================
[exec] DBTools Log - Thu Mar 29 08:59:28 CDT 2012
[exec] ==========================================
[exec]
[exec] Command: install database schema from driver file
[exec] To URL: jdbc:clarity:sqlserver://ndcmsqld03:1433;DatabaseName=niku;InsensitiveResultSetBufferSize=0;ProgramName=Clarity
[exec] As user: Niku
[exec] For vendor: mssql
[exec] Loading DBDriver file: d:\NIKU\Clarity\database\content\csk\preupgrade-driver.xml
[exec] Loading DBDriver file: d:\NIKU\Clarity\database\content\csk\preupgrade-driver.xml
[exec] Current database version is database_csk_2.2.0.0007-preupgrade
[exec] DBDriver for database_csk_2.2.0.0007-preupgrade
[exec] DBDriver has already been installed!
[exec]
[exec] Total time: 0H:0M:0S
[exec] - Initializing: pma.init...
[exec] SYS 2012-03-29 08:59:30,013 [main] niku.union Initializing: pma.init...

BUILD FAILED

D:\NIKU\Install\PMO_2.2\install.xml:68: The following error occurred while executing this line:
D:\NIKU\Install\PMO_2.2\install.xml:83: The following error occurred while executing this line:
D:\NIKU\Install\PMO_2.2\package\install.xml:135: The following error occurred while executing this line:
D:\NIKU\Install\PMO_2.2\package\install.xml:271: exec returned: 2

at org.apache.tools.ant.ProjectHelper.addLocationToBuildException(ProjectHelper.java:539)

at org.apache.tools.ant.taskdefs.Ant.execute(Ant.java:384)

at org.apache.tools.ant.taskdefs.CallTarget.execute(CallTarget.java:107)

at com.niku.tools.taskdefs.IfTask.execute(IfTask.java:209)

at org.apache.tools.ant.Task.perform(Task.java:364)

at com.niku.tools.taskdefs.ChooseTask.execute(ChooseTask.java:132)

at org.apache.tools.ant.UnknownElement.execute(UnknownElement.java:275)

at org.apache.tools.ant.Task.perform(Task.java:364)

at com.niku.tools.taskdefs.IfTask.execute(IfTask.java:204)

at org.apache.tools.ant.Task.perform(Task.java:364)

at com.niku.tools.taskdefs.ChooseTask.execute(ChooseTask.java:132)

at org.apache.tools.ant.UnknownElement.execute(UnknownElement.java:275)

at org.apache.tools.ant.Task.perform(Task.java:364)

at org.apache.tools.ant.Target.execute(Target.java:342)

at org.apache.tools.ant.Target.performTasks(Target.java:370)

at org.apache.tools.ant.Project.executeSortedTargets(Project.java:1216)

at org.apache.tools.ant.Project.executeTarget(Project.java:1185)

at org.apache.tools.ant.helper.DefaultExecutor.executeTargets(DefaultExecutor.java:40)

at org.apache.tools.ant.Project.executeTargets(Project.java:1068)

at org.apache.tools.ant.Main.runBuild(Main.java:675)

at org.apache.tools.ant.Main.startAnt(Main.java:190)

at org.apache.tools.ant.launch.Launcher.run(Launcher.java:246)

at org.apache.tools.ant.launch.Launcher.main(Launcher.java:67)
Caused by: D:\NIKU\Install\PMO_2.2\install.xml:83: The following error occurred while executing this line:
D:\NIKU\Install\PMO_2.2\package\install.xml:135: The following error occurred while executing this line:
D:\NIKU\Install\PMO_2.2\package\install.xml:271: exec returned: 2

at org.apache.tools.ant.ProjectHelper.addLocationToBuildException(ProjectHelper.java:539)

at org.apache.tools.ant.taskdefs.Ant.execute(Ant.java:384)

at org.apache.tools.ant.UnknownElement.execute(UnknownElement.java:275)

at org.apache.tools.ant.Task.perform(Task.java:364)

at org.apache.tools.ant.Target.execute(Target.java:342)

at org.apache.tools.ant.Target.performTasks(Target.java:370)

at org.apache.tools.ant.Project.executeSortedTargets(Project.java:1216)

at org.apache.tools.ant.helper.SingleCheckExecutor.executeTargets(SingleCheckExecutor.java:37)

at org.apache.tools.ant.Project.executeTargets(Project.java:1068)

at org.apache.tools.ant.taskdefs.Ant.execute(Ant.java:382)

... 21 more
Caused by: D:\NIKU\Install\PMO_2.2\package\install.xml:135: The following error occurred while executing this line:
D:\NIKU\Install\PMO_2.2\package\install.xml:271: exec returned: 2

at org.apache.tools.ant.ProjectHelper.addLocationToBuildException(ProjectHelper.java:539)

at org.apache.tools.ant.taskdefs.Ant.execute(Ant.java:384)

at org.apache.tools.ant.taskdefs.CallTarget.execute(CallTarget.java:107)

at com.niku.tools.taskdefs.IfTask.execute(IfTask.java:209)

at org.apache.tools.ant.Task.perform(Task.java:364)

at com.niku.tools.taskdefs.ChooseTask.execute(ChooseTask.java:132)

at org.apache.tools.ant.UnknownElement.execute(UnknownElement.java:275)

at org.apache.tools.ant.Task.perform(Task.java:364)

at org.apache.tools.ant.Target.execute(Target.java:342)

at org.apache.tools.ant.Target.performTasks(Target.java:370)

at org.apache.tools.ant.Project.executeSortedTargets(Project.java:1216)

at org.apache.tools.ant.helper.SingleCheckExecutor.executeTargets(SingleCheckExecutor.java:37)

at org.apache.tools.ant.Project.executeTargets(Project.java:1068)

at org.apache.tools.ant.taskdefs.Ant.execute(Ant.java:382)

... 29 more
Caused by: D:\NIKU\Install\PMO_2.2\package\install.xml:271: exec returned: 2

at org.apache.tools.ant.taskdefs.ExecTask.runExecute(ExecTask.java:591)

at org.apache.tools.ant.taskdefs.ExecTask.runExec(ExecTask.java:617)

at org.apache.tools.ant.taskdefs.ExecTask.execute(ExecTask.java:452)

at org.apache.tools.ant.UnknownElement.execute(UnknownElement.java:275)

at org.apache.tools.ant.Task.perform(Task.java:364)

at org.apache.tools.ant.Target.execute(Target.java:342)

at org.apache.tools.ant.Target.performTasks(Target.java:370)

at org.apache.tools.ant.Project.executeSortedTargets(Project.java:1216)

at org.apache.tools.ant.helper.SingleCheckExecutor.executeTargets(SingleCheckExecutor.java:37)

at org.apache.tools.ant.Project.executeTargets(Project.java:1068)

at org.apache.tools.ant.taskdefs.Ant.execute(Ant.java:382)

... 41 more
--- Nested Exception ---
D:\NIKU\Install\PMO_2.2\install.xml:83: The following error occurred while executing this line:
D:\NIKU\Install\PMO_2.2\package\install.xml:135: The following error occurred while executing this line:
D:\NIKU\Install\PMO_2.2\package\install.xml:271: exec returned: 2

at org.apache.tools.ant.ProjectHelper.addLocationToBuildException(ProjectHelper.java:539)

at org.apache.tools.ant.taskdefs.Ant.execute(Ant.java:384)

at org.apache.tools.ant.UnknownElement.execute(UnknownElement.java:275)

at org.apache.tools.ant.Task.perform(Task.java:364)

at org.apache.tools.ant.Target.execute(Target.java:342)

at org.apache.tools.ant.Target.performTasks(Target.java:370)

at org.apache.tools.ant.Project.executeSortedTargets(Project.java:1216)

at org.apache.tools.ant.helper.SingleCheckExecutor.executeTargets(SingleCheckExecutor.java:37)

at org.apache.tools.ant.Project.executeTargets(Project.java:1068)

at org.apache.tools.ant.taskdefs.Ant.execute(Ant.java:382)

at org.apache.tools.ant.taskdefs.CallTarget.execute(CallTarget.java:107)

at com.niku.tools.taskdefs.IfTask.execute(IfTask.java:209)

at org.apache.tools.ant.Task.perform(Task.java:364)

at com.niku.tools.taskdefs.ChooseTask.execute(ChooseTask.java:132)

at org.apache.tools.ant.UnknownElement.execute(UnknownElement.java:275)

at org.apache.tools.ant.Task.perform(Task.java:364)

at com.niku.tools.taskdefs.IfTask.execute(IfTask.java:204)

at org.apache.tools.ant.Task.perform(Task.java:364)

at com.niku.tools.taskdefs.ChooseTask.execute(ChooseTask.java:132)

at org.apache.tools.ant.UnknownElement.execute(UnknownElement.java:275)

at org.apache.tools.ant.Task.perform(Task.java:364)

at org.apache.tools.ant.Target.execute(Target.java:342)

at org.apache.tools.ant.Target.performTasks(Target.java:370)

at org.apache.tools.ant.Project.executeSortedTargets(Project.java:1216)

at org.apache.tools.ant.Project.executeTarget(Project.java:1185)

at org.apache.tools.ant.helper.DefaultExecutor.executeTargets(DefaultExecutor.java:40)

at org.apache.tools.ant.Project.executeTargets(Project.java:1068)

at org.apache.tools.ant.Main.runBuild(Main.java:675)

at org.apache.tools.ant.Main.startAnt(Main.java:190)

at org.apache.tools.ant.launch.Launcher.run(Launcher.java:246)

at org.apache.tools.ant.launch.Launcher.main(Launcher.java:67)
Caused by: D:\NIKU\Install\PMO_2.2\package\install.xml:135: The following error occurred while executing this line:
D:\NIKU\Install\PMO_2.2\package\install.xml:271: exec returned: 2

at org.apache.tools.ant.ProjectHelper.addLocationToBuildException(ProjectHelper.java:539)

at org.apache.tools.ant.taskdefs.Ant.execute(Ant.java:384)

at org.apache.tools.ant.taskdefs.CallTarget.execute(CallTarget.java:107)

at com.niku.tools.taskdefs.IfTask.execute(IfTask.java:209)

at org.apache.tools.ant.Task.perform(Task.java:364)

at com.niku.tools.taskdefs.ChooseTask.execute(ChooseTask.java:132)

at org.apache.tools.ant.UnknownElement.execute(UnknownElement.java:275)

at org.apache.tools.ant.Task.perform(Task.java:364)

at org.apache.tools.ant.Target.execute(Target.java:342)

at org.apache.tools.ant.Target.performTasks(Target.java:370)

at org.apache.tools.ant.Project.executeSortedTargets(Project.java:1216)

at org.apache.tools.ant.helper.SingleCheckExecutor.executeTargets(SingleCheckExecutor.java:37)

at org.apache.tools.ant.Project.executeTargets(Project.java:1068)

at org.apache.tools.ant.taskdefs.Ant.execute(Ant.java:382)

... 29 more
Caused by: D:\NIKU\Install\PMO_2.2\package\install.xml:271: exec returned: 2

at org.apache.tools.ant.taskdefs.ExecTask.runExecute(ExecTask.java:591)

at org.apache.tools.ant.taskdefs.ExecTask.runExec(ExecTask.java:617)

at org.apache.tools.ant.taskdefs.ExecTask.execute(ExecTask.java:452)

at org.apache.tools.ant.UnknownElement.execute(UnknownElement.java:275)

at org.apache.tools.ant.Task.perform(Task.java:364)

at org.apache.tools.ant.Target.execute(Target.java:342)

at org.apache.tools.ant.Target.performTasks(Target.java:370)

at org.apache.tools.ant.Project.executeSortedTargets(Project.java:1216)

at org.apache.tools.ant.helper.SingleCheckExecutor.executeTargets(SingleCheckExecutor.java:37)

at org.apache.tools.ant.Project.executeTargets(Project.java:1068)

at org.apache.tools.ant.taskdefs.Ant.execute(Ant.java:382)

... 41 more
--- Nested Exception ---
D:\NIKU\Install\PMO_2.2\package\install.xml:135: The following error occurred while executing this line:
D:\NIKU\Install\PMO_2.2\package\install.xml:271: exec returned: 2

at org.apache.tools.ant.ProjectHelper.addLocationToBuildException(ProjectHelper.java:539)

at org.apache.tools.ant.taskdefs.Ant.execute(Ant.java:384)

at org.apache.tools.ant.taskdefs.CallTarget.execute(CallTarget.java:107)

at com.niku.tools.taskdefs.IfTask.execute(IfTask.java:209)

at org.apache.tools.ant.Task.perform(Task.java:364)

at com.niku.tools.taskdefs.ChooseTask.execute(ChooseTask.java:132)

at org.apache.tools.ant.UnknownElement.execute(UnknownElement.java:275)

at org.apache.tools.ant.Task.perform(Task.java:364)

at org.apache.tools.ant.Target.execute(Target.java:342)

at org.apache.tools.ant.Target.performTasks(Target.java:370)

at org.apache.tools.ant.Project.executeSortedTargets(Project.java:1216)

at org.apache.tools.ant.helper.SingleCheckExecutor.executeTargets(SingleCheckExecutor.java:37)

at org.apache.tools.ant.Project.executeTargets(Project.java:1068)

at org.apache.tools.ant.taskdefs.Ant.execute(Ant.java:382)

at org.apache.tools.ant.UnknownElement.execute(UnknownElement.java:275)

at org.apache.tools.ant.Task.perform(Task.java:364)

at org.apache.tools.ant.Target.execute(Target.java:342)

at org.apache.tools.ant.Target.performTasks(Target.java:370)

at org.apache.tools.ant.Project.executeSortedTargets(Project.java:1216)

at org.apache.tools.ant.helper.SingleCheckExecutor.executeTargets(SingleCheckExecutor.java:37)

at org.apache.tools.ant.Project.executeTargets(Project.java:1068)

at org.apache.tools.ant.taskdefs.Ant.execute(Ant.java:382)

at org.apache.tools.ant.taskdefs.CallTarget.execute(CallTarget.java:107)

at com.niku.tools.taskdefs.IfTask.execute(IfTask.java:209)

at org.apache.tools.ant.Task.perform(Task.java:364)

at com.niku.tools.taskdefs.ChooseTask.execute(ChooseTask.java:132)

at org.apache.tools.ant.UnknownElement.execute(UnknownElement.java:275)

at org.apache.tools.ant.Task.perform(Task.java:364)

at com.niku.tools.taskdefs.IfTask.execute(IfTask.java:204)

at org.apache.tools.ant.Task.perform(Task.java:364)

at com.niku.tools.taskdefs.ChooseTask.execute(ChooseTask.java:132)

at org.apache.tools.ant.UnknownElement.execute(UnknownElement.java:275)

at org.apache.tools.ant.Task.perform(Task.java:364)

at org.apache.tools.ant.Target.execute(Target.java:342)

at org.apache.tools.ant.Target.performTasks(Target.java:370)

at org.apache.tools.ant.Project.executeSortedTargets(Project.java:1216)

at org.apache.tools.ant.Project.executeTarget(Project.java:1185)

at org.apache.tools.ant.helper.DefaultExecutor.executeTargets(DefaultExecutor.java:40)

at org.apache.tools.ant.Project.executeTargets(Project.java:1068)

at org.apache.tools.ant.Main.runBuild(Main.java:675)

at org.apache.tools.ant.Main.startAnt(Main.java:190)

at org.apache.tools.ant.launch.Launcher.run(Launcher.java:246)

at org.apache.tools.ant.launch.Launcher.main(Launcher.java:67)
Caused by: D:\NIKU\Install\PMO_2.2\package\install.xml:271: exec returned: 2

at org.apache.tools.ant.taskdefs.ExecTask.runExecute(ExecTask.java:591)

at org.apache.tools.ant.taskdefs.ExecTask.runExec(ExecTask.java:617)

at org.apache.tools.ant.taskdefs.ExecTask.execute(ExecTask.java:452)

at org.apache.tools.ant.UnknownElement.execute(UnknownElement.java:275)

at org.apache.tools.ant.Task.perform(Task.java:364)

at org.apache.tools.ant.Target.execute(Target.java:342)

at org.apache.tools.ant.Target.performTasks(Target.java:370)

at org.apache.tools.ant.Project.executeSortedTargets(Project.java:1216)

at org.apache.tools.ant.helper.SingleCheckExecutor.executeTargets(SingleCheckExecutor.java:37)

at org.apache.tools.ant.Project.executeTargets(Project.java:1068)

at org.apache.tools.ant.taskdefs.Ant.execute(Ant.java:382)

... 41 more
--- Nested Exception ---
D:\NIKU\Install\PMO_2.2\package\install.xml:271: exec returned: 2

at org.apache.tools.ant.taskdefs.ExecTask.runExecute(ExecTask.java:591)

at org.apache.tools.ant.taskdefs.ExecTask.runExec(ExecTask.java:617)

at org.apache.tools.ant.taskdefs.ExecTask.execute(ExecTask.java:452)

at org.apache.tools.ant.UnknownElement.execute(UnknownElement.java:275)

at org.apache.tools.ant.Task.perform(Task.java:364)

at org.apache.tools.ant.Target.execute(Target.java:342)

at org.apache.tools.ant.Target.performTasks(Target.java:370)

at org.apache.tools.ant.Project.executeSortedTargets(Project.java:1216)

at org.apache.tools.ant.helper.SingleCheckExecutor.executeTargets(SingleCheckExecutor.java:37)

at org.apache.tools.ant.Project.executeTargets(Project.java:1068)

at org.apache.tools.ant.taskdefs.Ant.execute(Ant.java:382)

at org.apache.tools.ant.taskdefs.CallTarget.execute(CallTarget.java:107)

at com.niku.tools.taskdefs.IfTask.execute(IfTask.java:209)

at org.apache.tools.ant.Task.perform(Task.java:364)

at com.niku.tools.taskdefs.ChooseTask.execute(ChooseTask.java:132)

at org.apache.tools.ant.UnknownElement.execute(UnknownElement.java:275)

at org.apache.tools.ant.Task.perform(Task.java:364)

at org.apache.tools.ant.Target.execute(Target.java:342)

at org.apache.tools.ant.Target.performTasks(Target.java:370)

at org.apache.tools.ant.Project.executeSortedTargets(Project.java:1216)

at org.apache.tools.ant.helper.SingleCheckExecutor.executeTargets(SingleCheckExecutor.java:37)

at org.apache.tools.ant.Project.executeTargets(Project.java:1068)

at org.apache.tools.ant.taskdefs.Ant.execute(Ant.java:382)

at org.apache.tools.ant.UnknownElement.execute(UnknownElement.java:275)

at org.apache.tools.ant.Task.perform(Task.java:364)

at org.apache.tools.ant.Target.execute(Target.java:342)

at org.apache.tools.ant.Target.performTasks(Target.java:370)

at org.apache.tools.ant.Project.executeSortedTargets(Project.java:1216)

at org.apache.tools.ant.helper.SingleCheckExecutor.executeTargets(SingleCheckExecutor.java:37)

at org.apache.tools.ant.Project.executeTargets(Project.java:1068)

at org.apache.tools.ant.taskdefs.Ant.execute(Ant.java:382)

at org.apache.tools.ant.taskdefs.CallTarget.execute(CallTarget.java:107)

at com.niku.tools.taskdefs.IfTask.execute(IfTask.java:209)

at org.apache.tools.ant.Task.perform(Task.java:364)

at com.niku.tools.taskdefs.ChooseTask.execute(ChooseTask.java:132)

at org.apache.tools.ant.UnknownElement.execute(UnknownElement.java:275)

at org.apache.tools.ant.Task.perform(Task.java:364)

at com.niku.tools.taskdefs.IfTask.execute(IfTask.java:204)

at org.apache.tools.ant.Task.perform(Task.java:364)

at com.niku.tools.taskdefs.ChooseTask.execute(ChooseTask.java:132)

at org.apache.tools.ant.UnknownElement.execute(UnknownElement.java:275)

at org.apache.tools.ant.Task.perform(Task.java:364)

at org.apache.tools.ant.Target.execute(Target.java:342)

at org.apache.tools.ant.Target.performTasks(Target.java:370)

at org.apache.tools.ant.Project.executeSortedTargets(Project.java:1216)

at org.apache.tools.ant.Project.executeTarget(Project.java:1185)

at org.apache.tools.ant.helper.DefaultExecutor.executeTargets(DefaultExecutor.java:40)

at org.apache.tools.ant.Project.executeTargets(Project.java:1068)

at org.apache.tools.ant.Main.runBuild(Main.java:675)

at org.apache.tools.ant.Main.startAnt(Main.java:190)

at org.apache.tools.ant.launch.Launcher.run(Launcher.java:246)

at org.apache.tools.ant.launch.Launcher.main(Launcher.java:67)
[echo]
-------------------------------------------------------------
MADE IT HERE
-------------------------------------------------------------

[echo]
-------------------------------------------------------------
MADE IT HERE2
-------------------------------------------------------------

[echo]
-------------------------------------------------------------
This program will install package csk:

See the included README.txt for more information.
-------------------------------------------------------------


_install:
[echo]

init:

install:
[echo]
-------------------------------------------------------------
This program will install the PMO Accelerator

Version: 2.2.0

Warning:

* The PMO Accelerator cannot
be automatically uninstalled.

* The PMO Accelerator sample data,
which can be installed separately,
is intended for demonstration
purposes only and should not be
installed to a production server.
There is no mechanism for
uninstalling the sample data.

* This PMO Accelerator
update must be applied against
Clarity version 12.1.0 or higher.

* Review the Read Me file prior to installation.
-------------------------------------------------------------

[echo]

init:

files:

pack-config:

remove-attribute:
[echo] Removing obj_alignment attribute...
[java] Attribute with the given specifications {ext_type=formula, attribute=obj_alignment, object=inv, type=number} not found. No removal necessary.

protect-view:
[echo] Getting view information...
[java] Starting view protection
[java] Completed view protection

deploy:
[exec] Content Pack csk version 8.1.0.4247 has been deployed
[exec] Installing content... csk
[exec] Installing content items that do not already exist or have the force option set to true
[exec] ==========================================
[exec] DBTools Log - Thu Mar 29 09:13:55 CDT 2012
[exec] ==========================================
[exec]
[exec] Command: install database schema from driver file
[exec] To URL: jdbc:clarity:sqlserver://ndcmsqld03:1433;DatabaseName=niku;InsensitiveResultSetBufferSize=0;ProgramName=Clarity
[exec] As user: Niku
[exec] For vendor: mssql
[exec] Loading DBDriver file: d:\NIKU\Clarity\database\content\csk\preupgrade-driver.xml
[exec] Loading DBDriver file: d:\NIKU\Clarity\database\content\csk\preupgrade-driver.xml
[exec] Current database version is database_csk_2.2.0.0007-preupgrade
[exec] DBDriver for database_csk_2.2.0.0007-preupgrade
[exec] DBDriver has already been installed!
[exec]
[exec] Total time: 0H:0M:0S
[exec] - Initializing: pma.init...
[exec] SYS 2012-03-29 09:13:56,880 [main] niku.union Initializing: pma.init...

BUILD FAILED

D:\NIKU\Install\PMO_2.2\install.xml:68: The following error occurred while executing this line:
D:\NIKU\Install\PMO_2.2\install.xml:83: The following error occurred while executing this line:
D:\NIKU\Install\PMO_2.2\package\install.xml:135: The following error occurred while executing this line:
D:\NIKU\Install\PMO_2.2\package\install.xml:271: exec returned: 2

at org.apache.tools.ant.ProjectHelper.addLocationToBuildException(ProjectHelper.java:539)

at org.apache.tools.ant.taskdefs.Ant.execute(Ant.java:384)

at org.apache.tools.ant.taskdefs.CallTarget.execute(CallTarget.java:107)

at com.niku.tools.taskdefs.IfTask.execute(IfTask.java:209)

at org.apache.tools.ant.Task.perform(Task.java:364)

at com.niku.tools.taskdefs.ChooseTask.execute(ChooseTask.java:132)

at org.apache.tools.ant.UnknownElement.execute(UnknownElement.java:275)

at org.apache.tools.ant.Task.perform(Task.java:364)

at com.niku.tools.taskdefs.IfTask.execute(IfTask.java:204)

at org.apache.tools.ant.Task.perform(Task.java:364)

at com.niku.tools.taskdefs.ChooseTask.execute(ChooseTask.java:132)

at org.apache.tools.ant.UnknownElement.execute(UnknownElement.java:275)

at org.apache.tools.ant.Task.perform(Task.java:364)

at org.apache.tools.ant.Target.execute(Target.java:342)

at org.apache.tools.ant.Target.performTasks(Target.java:370)

at org.apache.tools.ant.Project.executeSortedTargets(Project.java:1216)

at org.apache.tools.ant.Project.executeTarget(Project.java:1185)

at org.apache.tools.ant.helper.DefaultExecutor.executeTargets(DefaultExecutor.java:40)

at org.apache.tools.ant.Project.executeTargets(Project.java:1068)

at org.apache.tools.ant.Main.runBuild(Main.java:675)

at org.apache.tools.ant.Main.startAnt(Main.java:190)

at org.apache.tools.ant.launch.Launcher.run(Launcher.java:246)

at org.apache.tools.ant.launch.Launcher.main(Launcher.java:67)
Caused by: D:\NIKU\Install\PMO_2.2\install.xml:83: The following error occurred while executing this line:
D:\NIKU\Install\PMO_2.2\package\install.xml:135: The following error occurred while executing this line:
D:\NIKU\Install\PMO_2.2\package\install.xml:271: exec returned: 2

at org.apache.tools.ant.ProjectHelper.addLocationToBuildException(ProjectHelper.java:539)

at org.apache.tools.ant.taskdefs.Ant.execute(Ant.java:384)

at org.apache.tools.ant.UnknownElement.execute(UnknownElement.java:275)

at org.apache.tools.ant.Task.perform(Task.java:364)

at org.apache.tools.ant.Target.execute(Target.java:342)

at org.apache.tools.ant.Target.performTasks(Target.java:370)

at org.apache.tools.ant.Project.executeSortedTargets(Project.java:1216)

at org.apache.tools.ant.helper.SingleCheckExecutor.executeTargets(SingleCheckExecutor.java:37)

at org.apache.tools.ant.Project.executeTargets(Project.java:1068)

at org.apache.tools.ant.taskdefs.Ant.execute(Ant.java:382)

... 21 more
Caused by: D:\NIKU\Install\PMO_2.2\package\install.xml:135: The following error occurred while executing this line:
D:\NIKU\Install\PMO_2.2\package\install.xml:271: exec returned: 2

at org.apache.tools.ant.ProjectHelper.addLocationToBuildException(ProjectHelper.java:539)

at org.apache.tools.ant.taskdefs.Ant.execute(Ant.java:384)

at org.apache.tools.ant.taskdefs.CallTarget.execute(CallTarget.java:107)

at com.niku.tools.taskdefs.IfTask.execute(IfTask.java:209)

at org.apache.tools.ant.Task.perform(Task.java:364)

at com.niku.tools.taskdefs.ChooseTask.execute(ChooseTask.java:132)

at org.apache.tools.ant.UnknownElement.execute(UnknownElement.java:275)

at org.apache.tools.ant.Task.perform(Task.java:364)

at org.apache.tools.ant.Target.execute(Target.java:342)

at org.apache.tools.ant.Target.performTasks(Target.java:370)

at org.apache.tools.ant.Project.executeSortedTargets(Project.java:1216)

at org.apache.tools.ant.helper.SingleCheckExecutor.executeTargets(SingleCheckExecutor.java:37)

at org.apache.tools.ant.Project.executeTargets(Project.java:1068)

at org.apache.tools.ant.taskdefs.Ant.execute(Ant.java:382)

... 29 more
Caused by: D:\NIKU\Install\PMO_2.2\package\install.xml:271: exec returned: 2

at org.apache.tools.ant.taskdefs.ExecTask.runExecute(ExecTask.java:591)

at org.apache.tools.ant.taskdefs.ExecTask.runExec(ExecTask.java:617)

at org.apache.tools.ant.taskdefs.ExecTask.execute(ExecTask.java:452)

at org.apache.tools.ant.UnknownElement.execute(UnknownElement.java:275)

at org.apache.tools.ant.Task.perform(Task.java:364)

at org.apache.tools.ant.Target.execute(Target.java:342)

at org.apache.tools.ant.Target.performTasks(Target.java:370)

at org.apache.tools.ant.Project.executeSortedTargets(Project.java:1216)

at org.apache.tools.ant.helper.SingleCheckExecutor.executeTargets(SingleCheckExecutor.java:37)

at org.apache.tools.ant.Project.executeTargets(Project.java:1068)

at org.apache.tools.ant.taskdefs.Ant.execute(Ant.java:382)

... 41 more
--- Nested Exception ---
D:\NIKU\Install\PMO_2.2\install.xml:83: The following error occurred while executing this line:
D:\NIKU\Install\PMO_2.2\package\install.xml:135: The following error occurred while executing this line:
D:\NIKU\Install\PMO_2.2\package\install.xml:271: exec returned: 2

at org.apache.tools.ant.ProjectHelper.addLocationToBuildException(ProjectHelper.java:539)

at org.apache.tools.ant.taskdefs.Ant.execute(Ant.java:384)

at org.apache.tools.ant.UnknownElement.execute(UnknownElement.java:275)

at org.apache.tools.ant.Task.perform(Task.java:364)

at org.apache.tools.ant.Target.execute(Target.java:342)

at org.apache.tools.ant.Target.performTasks(Target.java:370)

at org.apache.tools.ant.Project.executeSortedTargets(Project.java:1216)

at org.apache.tools.ant.helper.SingleCheckExecutor.executeTargets(SingleCheckExecutor.java:37)

at org.apache.tools.ant.Project.executeTargets(Project.java:1068)

at org.apache.tools.ant.taskdefs.Ant.execute(Ant.java:382)

at org.apache.tools.ant.taskdefs.CallTarget.execute(CallTarget.java:107)

at com.niku.tools.taskdefs.IfTask.execute(IfTask.java:209)

at org.apache.tools.ant.Task.perform(Task.java:364)

at com.niku.tools.taskdefs.ChooseTask.execute(ChooseTask.java:132)

at org.apache.tools.ant.UnknownElement.execute(UnknownElement.java:275)

at org.apache.tools.ant.Task.perform(Task.java:364)

at com.niku.tools.taskdefs.IfTask.execute(IfTask.java:204)

at org.apache.tools.ant.Task.perform(Task.java:364)

at com.niku.tools.taskdefs.ChooseTask.execute(ChooseTask.java:132)

at org.apache.tools.ant.UnknownElement.execute(UnknownElement.java:275)

at org.apache.tools.ant.Task.perform(Task.java:364)

at org.apache.tools.ant.Target.execute(Target.java:342)

at org.apache.tools.ant.Target.performTasks(Target.java:370)

at org.apache.tools.ant.Project.executeSortedTargets(Project.java:1216)

at org.apache.tools.ant.Project.executeTarget(Project.java:1185)

at org.apache.tools.ant.helper.DefaultExecutor.executeTargets(DefaultExecutor.java:40)

at org.apache.tools.ant.Project.executeTargets(Project.java:1068)

at org.apache.tools.ant.Main.runBuild(Main.java:675)

at org.apache.tools.ant.Main.startAnt(Main.java:190)

at org.apache.tools.ant.launch.Launcher.run(Launcher.java:246)

at org.apache.tools.ant.launch.Launcher.main(Launcher.java:67)
Caused by: D:\NIKU\Install\PMO_2.2\package\install.xml:135: The following error occurred while executing this line:
D:\NIKU\Install\PMO_2.2\package\install.xml:271: exec returned: 2

at org.apache.tools.ant.ProjectHelper.addLocationToBuildException(ProjectHelper.java:539)

at org.apache.tools.ant.taskdefs.Ant.execute(Ant.java:384)

at org.apache.tools.ant.taskdefs.CallTarget.execute(CallTarget.java:107)

at com.niku.tools.taskdefs.IfTask.execute(IfTask.java:209)

at org.apache.tools.ant.Task.perform(Task.java:364)

at com.niku.tools.taskdefs.ChooseTask.execute(ChooseTask.java:132)

at org.apache.tools.ant.UnknownElement.execute(UnknownElement.java:275)

at org.apache.tools.ant.Task.perform(Task.java:364)

at org.apache.tools.ant.Target.execute(Target.java:342)

at org.apache.tools.ant.Target.performTasks(Target.java:370)

at org.apache.tools.ant.Project.executeSortedTargets(Project.java:1216)

at org.apache.tools.ant.helper.SingleCheckExecutor.executeTargets(SingleCheckExecutor.java:37)

at org.apache.tools.ant.Project.executeTargets(Project.java:1068)

at org.apache.tools.ant.taskdefs.Ant.execute(Ant.java:382)

... 29 more
Caused by: D:\NIKU\Install\PMO_2.2\package\install.xml:271: exec returned: 2

at org.apache.tools.ant.taskdefs.ExecTask.runExecute(ExecTask.java:591)

at org.apache.tools.ant.taskdefs.ExecTask.runExec(ExecTask.java:617)

at org.apache.tools.ant.taskdefs.ExecTask.execute(ExecTask.java:452)

at org.apache.tools.ant.UnknownElement.execute(UnknownElement.java:275)

at org.apache.tools.ant.Task.perform(Task.java:364)

at org.apache.tools.ant.Target.execute(Target.java:342)

at org.apache.tools.ant.Target.performTasks(Target.java:370)

at org.apache.tools.ant.Project.executeSortedTargets(Project.java:1216)

at org.apache.tools.ant.helper.SingleCheckExecutor.executeTargets(SingleCheckExecutor.java:37)

at org.apache.tools.ant.Project.executeTargets(Project.java:1068)

at org.apache.tools.ant.taskdefs.Ant.execute(Ant.java:382)

... 41 more
--- Nested Exception ---
D:\NIKU\Install\PMO_2.2\package\install.xml:135: The following error occurred while executing this line:
D:\NIKU\Install\PMO_2.2\package\install.xml:271: exec returned: 2

at org.apache.tools.ant.ProjectHelper.addLocationToBuildException(ProjectHelper.java:539)

at org.apache.tools.ant.taskdefs.Ant.execute(Ant.java:384)

at org.apache.tools.ant.taskdefs.CallTarget.execute(CallTarget.java:107)

at com.niku.tools.taskdefs.IfTask.execute(IfTask.java:209)

at org.apache.tools.ant.Task.perform(Task.java:364)

at com.niku.tools.taskdefs.ChooseTask.execute(ChooseTask.java:132)

at org.apache.tools.ant.UnknownElement.execute(UnknownElement.java:275)

at org.apache.tools.ant.Task.perform(Task.java:364)

at org.apache.tools.ant.Target.execute(Target.java:342)

at org.apache.tools.ant.Target.performTasks(Target.java:370)

at org.apache.tools.ant.Project.executeSortedTargets(Project.java:1216)

at org.apache.tools.ant.helper.SingleCheckExecutor.executeTargets(SingleCheckExecutor.java:37)

at org.apache.tools.ant.Project.executeTargets(Project.java:1068)

at org.apache.tools.ant.taskdefs.Ant.execute(Ant.java:382)

at org.apache.tools.ant.UnknownElement.execute(UnknownElement.java:275)

at org.apache.tools.ant.Task.perform(Task.java:364)

at org.apache.tools.ant.Target.execute(Target.java:342)

at org.apache.tools.ant.Target.performTasks(Target.java:370)

at org.apache.tools.ant.Project.executeSortedTargets(Project.java:1216)

at org.apache.tools.ant.helper.SingleCheckExecutor.executeTargets(SingleCheckExecutor.java:37)

at org.apache.tools.ant.Project.executeTargets(Project.java:1068)

at org.apache.tools.ant.taskdefs.Ant.execute(Ant.java:382)

at org.apache.tools.ant.taskdefs.CallTarget.execute(CallTarget.java:107)

at com.niku.tools.taskdefs.IfTask.execute(IfTask.java:209)

at org.apache.tools.ant.Task.perform(Task.java:364)

at com.niku.tools.taskdefs.ChooseTask.execute(ChooseTask.java:132)

at org.apache.tools.ant.UnknownElement.execute(UnknownElement.java:275)

at org.apache.tools.ant.Task.perform(Task.java:364)

at com.niku.tools.taskdefs.IfTask.execute(IfTask.java:204)

at org.apache.tools.ant.Task.perform(Task.java:364)

at com.niku.tools.taskdefs.ChooseTask.execute(ChooseTask.java:132)

at org.apache.tools.ant.UnknownElement.execute(UnknownElement.java:275)

at org.apache.tools.ant.Task.perform(Task.java:364)

at org.apache.tools.ant.Target.execute(Target.java:342)

at org.apache.tools.ant.Target.performTasks(Target.java:370)

at org.apache.tools.ant.Project.executeSortedTargets(Project.java:1216)

at org.apache.tools.ant.Project.executeTarget(Project.java:1185)

at org.apache.tools.ant.helper.DefaultExecutor.executeTargets(DefaultExecutor.java:40)

at org.apache.tools.ant.Project.executeTargets(Project.java:1068)

at org.apache.tools.ant.Main.runBuild(Main.java:675)

at org.apache.tools.ant.Main.startAnt(Main.java:190)

at org.apache.tools.ant.launch.Launcher.run(Launcher.java:246)

at org.apache.tools.ant.launch.Launcher.main(Launcher.java:67)
Caused by: D:\NIKU\Install\PMO_2.2\package\install.xml:271: exec returned: 2

at org.apache.tools.ant.taskdefs.ExecTask.runExecute(ExecTask.java:591)

at org.apache.tools.ant.taskdefs.ExecTask.runExec(ExecTask.java:617)

at org.apache.tools.ant.taskdefs.ExecTask.execute(ExecTask.java:452)

at org.apache.tools.ant.UnknownElement.execute(UnknownElement.java:275)

at org.apache.tools.ant.Task.perform(Task.java:364)

at org.apache.tools.ant.Target.execute(Target.java:342)

at org.apache.tools.ant.Target.performTasks(Target.java:370)

at org.apache.tools.ant.Project.executeSortedTargets(Project.java:1216)

at org.apache.tools.ant.helper.SingleCheckExecutor.executeTargets(SingleCheckExecutor.java:37)

at org.apache.tools.ant.Project.executeTargets(Project.java:1068)

at org.apache.tools.ant.taskdefs.Ant.execute(Ant.java:382)

... 41 more
--- Nested Exception ---
D:\NIKU\Install\PMO_2.2\package\install.xml:271: exec returned: 2

at org.apache.tools.ant.taskdefs.ExecTask.runExecute(ExecTask.java:591)

at org.apache.tools.ant.taskdefs.ExecTask.runExec(ExecTask.java:617)

at org.apache.tools.ant.taskdefs.ExecTask.execute(ExecTask.java:452)

at org.apache.tools.ant.UnknownElement.execute(UnknownElement.java:275)

at org.apache.tools.ant.Task.perform(Task.java:364)

at org.apache.tools.ant.Target.execute(Target.java:342)

at org.apache.tools.ant.Target.performTasks(Target.java:370)

at org.apache.tools.ant.Project.executeSortedTargets(Project.java:1216)

at org.apache.tools.ant.helper.SingleCheckExecutor.executeTargets(SingleCheckExecutor.java:37)

at org.apache.tools.ant.Project.executeTargets(Project.java:1068)

at org.apache.tools.ant.taskdefs.Ant.execute(Ant.java:382)

at org.apache.tools.ant.taskdefs.CallTarget.execute(CallTarget.java:107)

at com.niku.tools.taskdefs.IfTask.execute(IfTask.java:209)

at org.apache.tools.ant.Task.perform(Task.java:364)

at com.niku.tools.taskdefs.ChooseTask.execute(ChooseTask.java:132)

at org.apache.tools.ant.UnknownElement.execute(UnknownElement.java:275)

at org.apache.tools.ant.Task.perform(Task.java:364)

at org.apache.tools.ant.Target.execute(Target.java:342)

at org.apache.tools.ant.Target.performTasks(Target.java:370)

at org.apache.tools.ant.Project.executeSortedTargets(Project.java:1216)

at org.apache.tools.ant.helper.SingleCheckExecutor.executeTargets(SingleCheckExecutor.java:37)

at org.apache.tools.ant.Project.executeTargets(Project.java:1068)

at org.apache.tools.ant.taskdefs.Ant.execute(Ant.java:382)

at org.apache.tools.ant.UnknownElement.execute(UnknownElement.java:275)

at org.apache.tools.ant.Task.perform(Task.java:364)

at org.apache.tools.ant.Target.execute(Target.java:342)

at org.apache.tools.ant.Target.performTasks(Target.java:370)

at org.apache.tools.ant.Project.executeSortedTargets(Project.java:1216)

at org.apache.tools.ant.helper.SingleCheckExecutor.executeTargets(SingleCheckExecutor.java:37)

at org.apache.tools.ant.Project.executeTargets(Project.java:1068)

at org.apache.tools.ant.taskdefs.Ant.execute(Ant.java:382)

at org.apache.tools.ant.taskdefs.CallTarget.execute(CallTarget.java:107)

at com.niku.tools.taskdefs.IfTask.execute(IfTask.java:209)

at org.apache.tools.ant.Task.perform(Task.java:364)

at com.niku.tools.taskdefs.ChooseTask.execute(ChooseTask.java:132)

at org.apache.tools.ant.UnknownElement.execute(UnknownElement.java:275)

at org.apache.tools.ant.Task.perform(Task.java:364)

at com.niku.tools.taskdefs.IfTask.execute(IfTask.java:204)

at org.apache.tools.ant.Task.perform(Task.java:364)

at com.niku.tools.taskdefs.ChooseTask.execute(ChooseTask.java:132)

at org.apache.tools.ant.UnknownElement.execute(UnknownElement.java:275)

at org.apache.tools.ant.Task.perform(Task.java:364)

at org.apache.tools.ant.Target.execute(Target.java:342)

at org.apache.tools.ant.Target.performTasks(Target.java:370)

at org.apache.tools.ant.Project.executeSortedTargets(Project.java:1216)

at org.apache.tools.ant.Project.executeTarget(Project.java:1185)

at org.apache.tools.ant.helper.DefaultExecutor.executeTargets(DefaultExecutor.java:40)

at org.apache.tools.ant.Project.executeTargets(Project.java:1068)

at org.apache.tools.ant.Main.runBuild(Main.java:675)

at org.apache.tools.ant.Main.startAnt(Main.java:190)

at org.apache.tools.ant.launch.Launcher.run(Launcher.java:246)

at org.apache.tools.ant.launch.Launcher.main(Launcher.java:67)
[echo]
-------------------------------------------------------------
MADE IT HERE
-------------------------------------------------------------

[echo]
-------------------------------------------------------------
MADE IT HERE2
-------------------------------------------------------------

[echo]
-------------------------------------------------------------
This program will install package csk:

See the included README.txt for more information.
-------------------------------------------------------------


_install:
[echo]

init:

install:
[echo]
-------------------------------------------------------------
This program will install the PMO Accelerator

Version: 2.2.0

Warning:

* The PMO Accelerator cannot
be automatically uninstalled.

* The PMO Accelerator sample data,
which can be installed separately,
is intended for demonstration
purposes only and should not be
installed to a production server.
There is no mechanism for
uninstalling the sample data.

* This PMO Accelerator
update must be applied against
Clarity version 12.1.0 or higher.

* Review the Read Me file prior to installation.
-------------------------------------------------------------

[echo]

init:

files:

pack-config:

remove-attribute:
[echo] Removing obj_alignment attribute...
[java] Attribute with the given specifications {ext_type=formula, attribute=obj_alignment, object=inv, type=number} not found. No removal necessary.

protect-view:
[echo] Getting view information...
[java] Starting view protection
[java] Completed view protection

deploy:
[exec] Content Pack csk version 8.1.0.4247 has been deployed
[exec] Installing content... csk
[exec] Installing content items that do not already exist or have the force option set to true
[exec] ==========================================
[exec] DBTools Log - Thu Mar 29 09:31:00 CDT 2012
[exec] ==========================================
[exec]
[exec] Command: install database schema from driver file
[exec] To URL: jdbc:clarity:sqlserver://ndcmsqld03:1433;DatabaseName=niku;InsensitiveResultSetBufferSize=0;ProgramName=Clarity
[exec] As user: Niku
[exec] For vendor: mssql
[exec] Loading DBDriver file: d:\NIKU\Clarity\database\content\csk\preupgrade-driver.xml
[exec] Loading DBDriver file: d:\NIKU\Clarity\database\content\csk\preupgrade-driver.xml
[exec] Current database version is database_csk_2.2.0.0007-preupgrade
[exec] DBDriver for database_csk_2.2.0.0007-preupgrade
[exec] DBDriver has already been installed!
[exec]
[exec] Total time: 0H:0M:0S
[exec] - Initializing: pma.init...
[exec] SYS 2012-03-29 09:31:01,561 [main] niku.union Initializing: pma.init...

BUILD FAILED

D:\NIKU\Install\PMO_2.2\install.xml:68: The following error occurred while executing this line:
D:\NIKU\Install\PMO_2.2\install.xml:83: The following error occurred while executing this line:
D:\NIKU\Install\PMO_2.2\package\install.xml:135: The following error occurred while executing this line:
D:\NIKU\Install\PMO_2.2\package\install.xml:271: exec returned: 2

at org.apache.tools.ant.ProjectHelper.addLocationToBuildException(ProjectHelper.java:539)

at org.apache.tools.ant.taskdefs.Ant.execute(Ant.java:384)

at org.apache.tools.ant.taskdefs.CallTarget.execute(CallTarget.java:107)

at com.niku.tools.taskdefs.IfTask.execute(IfTask.java:209)

at org.apache.tools.ant.Task.perform(Task.java:364)

at com.niku.tools.taskdefs.ChooseTask.execute(ChooseTask.java:132)

at org.apache.tools.ant.UnknownElement.execute(UnknownElement.java:275)

at org.apache.tools.ant.Task.perform(Task.java:364)

at com.niku.tools.taskdefs.IfTask.execute(IfTask.java:204)

at org.apache.tools.ant.Task.perform(Task.java:364)

at com.niku.tools.taskdefs.ChooseTask.execute(ChooseTask.java:132)

at org.apache.tools.ant.UnknownElement.execute(UnknownElement.java:275)

at org.apache.tools.ant.Task.perform(Task.java:364)

at org.apache.tools.ant.Target.execute(Target.java:342)

at org.apache.tools.ant.Target.performTasks(Target.java:370)

at org.apache.tools.ant.Project.executeSortedTargets(Project.java:1216)

at org.apache.tools.ant.Project.executeTarget(Project.java:1185)

at org.apache.tools.ant.helper.DefaultExecutor.executeTargets(DefaultExecutor.java:40)

at org.apache.tools.ant.Project.executeTargets(Project.java:1068)

at org.apache.tools.ant.Main.runBuild(Main.java:675)

at org.apache.tools.ant.Main.startAnt(Main.java:190)

at org.apache.tools.ant.launch.Launcher.run(Launcher.java:246)

at org.apache.tools.ant.launch.Launcher.main(Launcher.java:67)
Caused by: D:\NIKU\Install\PMO_2.2\install.xml:83: The following error occurred while executing this line:
D:\NIKU\Install\PMO_2.2\package\install.xml:135: The following error occurred while executing this line:
D:\NIKU\Install\PMO_2.2\package\install.xml:271: exec returned: 2

at org.apache.tools.ant.ProjectHelper.addLocationToBuildException(ProjectHelper.java:539)

at org.apache.tools.ant.taskdefs.Ant.execute(Ant.java:384)

at org.apache.tools.ant.UnknownElement.execute(UnknownElement.java:275)

at org.apache.tools.ant.Task.perform(Task.java:364)

at org.apache.tools.ant.Target.execute(Target.java:342)

at org.apache.tools.ant.Target.performTasks(Target.java:370)

at org.apache.tools.ant.Project.executeSortedTargets(Project.java:1216)

at org.apache.tools.ant.helper.SingleCheckExecutor.executeTargets(SingleCheckExecutor.java:37)

at org.apache.tools.ant.Project.executeTargets(Project.java:1068)

at org.apache.tools.ant.taskdefs.Ant.execute(Ant.java:382)

... 21 more
Caused by: D:\NIKU\Install\PMO_2.2\package\install.xml:135: The following error occurred while executing this line:
D:\NIKU\Install\PMO_2.2\package\install.xml:271: exec returned: 2

at org.apache.tools.ant.ProjectHelper.addLocationToBuildException(ProjectHelper.java:539)

at org.apache.tools.ant.taskdefs.Ant.execute(Ant.java:384)

at org.apache.tools.ant.taskdefs.CallTarget.execute(CallTarget.java:107)

at com.niku.tools.taskdefs.IfTask.execute(IfTask.java:209)

at org.apache.tools.ant.Task.perform(Task.java:364)

at com.niku.tools.taskdefs.ChooseTask.execute(ChooseTask.java:132)

at org.apache.tools.ant.UnknownElement.execute(UnknownElement.java:275)

at org.apache.tools.ant.Task.perform(Task.java:364)

at org.apache.tools.ant.Target.execute(Target.java:342)

at org.apache.tools.ant.Target.performTasks(Target.java:370)

at org.apache.tools.ant.Project.executeSortedTargets(Project.java:1216)

at org.apache.tools.ant.helper.SingleCheckExecutor.executeTargets(SingleCheckExecutor.java:37)

at org.apache.tools.ant.Project.executeTargets(Project.java:1068)

at org.apache.tools.ant.taskdefs.Ant.execute(Ant.java:382)

... 29 more
Caused by: D:\NIKU\Install\PMO_2.2\package\install.xml:271: exec returned: 2

at org.apache.tools.ant.taskdefs.ExecTask.runExecute(ExecTask.java:591)

at org.apache.tools.ant.taskdefs.ExecTask.runExec(ExecTask.java:617)

at org.apache.tools.ant.taskdefs.ExecTask.execute(ExecTask.java:452)

at org.apache.tools.ant.UnknownElement.execute(UnknownElement.java:275)

at org.apache.tools.ant.Task.perform(Task.java:364)

at org.apache.tools.ant.Target.execute(Target.java:342)

at org.apache.tools.ant.Target.performTasks(Target.java:370)

at org.apache.tools.ant.Project.executeSortedTargets(Project.java:1216)

at org.apache.tools.ant.helper.SingleCheckExecutor.executeTargets(SingleCheckExecutor.java:37)

at org.apache.tools.ant.Project.executeTargets(Project.java:1068)

at org.apache.tools.ant.taskdefs.Ant.execute(Ant.java:382)

... 41 more
--- Nested Exception ---
D:\NIKU\Install\PMO_2.2\install.xml:83: The following error occurred while executing this line:
D:\NIKU\Install\PMO_2.2\package\install.xml:135: The following error occurred while executing this line:
D:\NIKU\Install\PMO_2.2\package\install.xml:271: exec returned: 2

at org.apache.tools.ant.ProjectHelper.addLocationToBuildException(ProjectHelper.java:539)

at org.apache.tools.ant.taskdefs.Ant.execute(Ant.java:384)

at org.apache.tools.ant.UnknownElement.execute(UnknownElement.java:275)

at org.apache.tools.ant.Task.perform(Task.java:364)

at org.apache.tools.ant.Target.execute(Target.java:342)

at org.apache.tools.ant.Target.performTasks(Target.java:370)

at org.apache.tools.ant.Project.executeSortedTargets(Project.java:1216)

at org.apache.tools.ant.helper.SingleCheckExecutor.executeTargets(SingleCheckExecutor.java:37)

at org.apache.tools.ant.Project.executeTargets(Project.java:1068)

at org.apache.tools.ant.taskdefs.Ant.execute(Ant.java:382)

at org.apache.tools.ant.taskdefs.CallTarget.execute(CallTarget.java:107)

at com.niku.tools.taskdefs.IfTask.execute(IfTask.java:209)

at org.apache.tools.ant.Task.perform(Task.java:364)

at com.niku.tools.taskdefs.ChooseTask.execute(ChooseTask.java:132)

at org.apache.tools.ant.UnknownElement.execute(UnknownElement.java:275)

at org.apache.tools.ant.Task.perform(Task.java:364)

at com.niku.tools.taskdefs.IfTask.execute(IfTask.java:204)

at org.apache.tools.ant.Task.perform(Task.java:364)

at com.niku.tools.taskdefs.ChooseTask.execute(ChooseTask.java:132)

at org.apache.tools.ant.UnknownElement.execute(UnknownElement.java:275)

at org.apache.tools.ant.Task.perform(Task.java:364)

at org.apache.tools.ant.Target.execute(Target.java:342)

at org.apache.tools.ant.Target.performTasks(Target.java:370)

at org.apache.tools.ant.Project.executeSortedTargets(Project.java:1216)

at org.apache.tools.ant.Project.executeTarget(Project.java:1185)

at org.apache.tools.ant.helper.DefaultExecutor.executeTargets(DefaultExecutor.java:40)

at org.apache.tools.ant.Project.executeTargets(Project.java:1068)

at org.apache.tools.ant.Main.runBuild(Main.java:675)

at org.apache.tools.ant.Main.startAnt(Main.java:190)

at org.apache.tools.ant.launch.Launcher.run(Launcher.java:246)

at org.apache.tools.ant.launch.Launcher.main(Launcher.java:67)
Caused by: D:\NIKU\Install\PMO_2.2\package\install.xml:135: The following error occurred while executing this line:
D:\NIKU\Install\PMO_2.2\package\install.xml:271: exec returned: 2

at org.apache.tools.ant.ProjectHelper.addLocationToBuildException(ProjectHelper.java:539)

at org.apache.tools.ant.taskdefs.Ant.execute(Ant.java:384)

at org.apache.tools.ant.taskdefs.CallTarget.execute(CallTarget.java:107)

at com.niku.tools.taskdefs.IfTask.execute(IfTask.java:209)

at org.apache.tools.ant.Task.perform(Task.java:364)

at com.niku.tools.taskdefs.ChooseTask.execute(ChooseTask.java:132)

at org.apache.tools.ant.UnknownElement.execute(UnknownElement.java:275)

at org.apache.tools.ant.Task.perform(Task.java:364)

at org.apache.tools.ant.Target.execute(Target.java:342)

at org.apache.tools.ant.Target.performTasks(Target.java:370)

at org.apache.tools.ant.Project.executeSortedTargets(Project.java:1216)

at org.apache.tools.ant.helper.SingleCheckExecutor.executeTargets(SingleCheckExecutor.java:37)

at org.apache.tools.ant.Project.executeTargets(Project.java:1068)

at org.apache.tools.ant.taskdefs.Ant.execute(Ant.java:382)

... 29 more
Caused by: D:\NIKU\Install\PMO_2.2\package\install.xml:271: exec returned: 2

at org.apache.tools.ant.taskdefs.ExecTask.runExecute(ExecTask.java:591)

at org.apache.tools.ant.taskdefs.ExecTask.runExec(ExecTask.java:617)

at org.apache.tools.ant.taskdefs.ExecTask.execute(ExecTask.java:452)

at org.apache.tools.ant.UnknownElement.execute(UnknownElement.java:275)

at org.apache.tools.ant.Task.perform(Task.java:364)

at org.apache.tools.ant.Target.execute(Target.java:342)

at org.apache.tools.ant.Target.performTasks(Target.java:370)

at org.apache.tools.ant.Project.executeSortedTargets(Project.java:1216)

at org.apache.tools.ant.helper.SingleCheckExecutor.executeTargets(SingleCheckExecutor.java:37)

at org.apache.tools.ant.Project.executeTargets(Project.java:1068)

at org.apache.tools.ant.taskdefs.Ant.execute(Ant.java:382)

... 41 more
--- Nested Exception ---
D:\NIKU\Install\PMO_2.2\package\install.xml:135: The following error occurred while executing this line:
D:\NIKU\Install\PMO_2.2\package\install.xml:271: exec returned: 2

at org.apache.tools.ant.ProjectHelper.addLocationToBuildException(ProjectHelper.java:539)

at org.apache.tools.ant.taskdefs.Ant.execute(Ant.java:384)

at org.apache.tools.ant.taskdefs.CallTarget.execute(CallTarget.java:107)

at com.niku.tools.taskdefs.IfTask.execute(IfTask.java:209)

at org.apache.tools.ant.Task.perform(Task.java:364)

at com.niku.tools.taskdefs.ChooseTask.execute(ChooseTask.java:132)

at org.apache.tools.ant.UnknownElement.execute(UnknownElement.java:275)

at org.apache.tools.ant.Task.perform(Task.java:364)

at org.apache.tools.ant.Target.execute(Target.java:342)

at org.apache.tools.ant.Target.performTasks(Target.java:370)

at org.apache.tools.ant.Project.executeSortedTargets(Project.java:1216)

at org.apache.tools.ant.helper.SingleCheckExecutor.executeTargets(SingleCheckExecutor.java:37)

at org.apache.tools.ant.Project.executeTargets(Project.java:1068)

at org.apache.tools.ant.taskdefs.Ant.execute(Ant.java:382)

at org.apache.tools.ant.UnknownElement.execute(UnknownElement.java:275)

at org.apache.tools.ant.Task.perform(Task.java:364)

at org.apache.tools.ant.Target.execute(Target.java:342)

at org.apache.tools.ant.Target.performTasks(Target.java:370)

at org.apache.tools.ant.Project.executeSortedTargets(Project.java:1216)

at org.apache.tools.ant.helper.SingleCheckExecutor.executeTargets(SingleCheckExecutor.java:37)

at org.apache.tools.ant.Project.executeTargets(Project.java:1068)

at org.apache.tools.ant.taskdefs.Ant.execute(Ant.java:382)

at org.apache.tools.ant.taskdefs.CallTarget.execute(CallTarget.java:107)

at com.niku.tools.taskdefs.IfTask.execute(IfTask.java:209)

at org.apache.tools.ant.Task.perform(Task.java:364)

at com.niku.tools.taskdefs.ChooseTask.execute(ChooseTask.java:132)

at org.apache.tools.ant.UnknownElement.execute(UnknownElement.java:275)

at org.apache.tools.ant.Task.perform(Task.java:364)

at com.niku.tools.taskdefs.IfTask.execute(IfTask.java:204)

at org.apache.tools.ant.Task.perform(Task.java:364)

at com.niku.tools.taskdefs.ChooseTask.execute(ChooseTask.java:132)

at org.apache.tools.ant.UnknownElement.execute(UnknownElement.java:275)

at org.apache.tools.ant.Task.perform(Task.java:364)

at org.apache.tools.ant.Target.execute(Target.java:342)

at org.apache.tools.ant.Target.performTasks(Target.java:370)

at org.apache.tools.ant.Project.executeSortedTargets(Project.java:1216)

at org.apache.tools.ant.Project.executeTarget(Project.java:1185)

at org.apache.tools.ant.helper.DefaultExecutor.executeTargets(DefaultExecutor.java:40)

at org.apache.tools.ant.Project.executeTargets(Project.java:1068)

at org.apache.tools.ant.Main.runBuild(Main.java:675)

at org.apache.tools.ant.Main.startAnt(Main.java:190)

at org.apache.tools.ant.launch.Launcher.run(Launcher.java:246)

at org.apache.tools.ant.launch.Launcher.main(Launcher.java:67)
Caused by: D:\NIKU\Install\PMO_2.2\package\install.xml:271: exec returned: 2

at org.apache.tools.ant.taskdefs.ExecTask.runExecute(ExecTask.java:591)

at org.apache.tools.ant.taskdefs.ExecTask.runExec(ExecTask.java:617)

at org.apache.tools.ant.taskdefs.ExecTask.execute(ExecTask.java:452)

at org.apache.tools.ant.UnknownElement.execute(UnknownElement.java:275)

at org.apache.tools.ant.Task.perform(Task.java:364)

at org.apache.tools.ant.Target.execute(Target.java:342)

at org.apache.tools.ant.Target.performTasks(Target.java:370)

at org.apache.tools.ant.Project.executeSortedTargets(Project.java:1216)

at org.apache.tools.ant.helper.SingleCheckExecutor.executeTargets(SingleCheckExecutor.java:37)

at org.apache.tools.ant.Project.executeTargets(Project.java:1068)

at org.apache.tools.ant.taskdefs.Ant.execute(Ant.java:382)

... 41 more
--- Nested Exception ---
D:\NIKU\Install\PMO_2.2\package\install.xml:271: exec returned: 2

at org.apache.tools.ant.taskdefs.ExecTask.runExecute(ExecTask.java:591)

at org.apache.tools.ant.taskdefs.ExecTask.runExec(ExecTask.java:617)

at org.apache.tools.ant.taskdefs.ExecTask.execute(ExecTask.java:452)

at org.apache.tools.ant.UnknownElement.execute(UnknownElement.java:275)

at org.apache.tools.ant.Task.perform(Task.java:364)

at org.apache.tools.ant.Target.execute(Target.java:342)

at org.apache.tools.ant.Target.performTasks(Target.java:370)

at org.apache.tools.ant.Project.executeSortedTargets(Project.java:1216)

at org.apache.tools.ant.helper.SingleCheckExecutor.executeTargets(SingleCheckExecutor.java:37)

at org.apache.tools.ant.Project.executeTargets(Project.java:1068)

at org.apache.tools.ant.taskdefs.Ant.execute(Ant.java:382)

at org.apache.tools.ant.taskdefs.CallTarget.execute(CallTarget.java:107)

at com.niku.tools.taskdefs.IfTask.execute(IfTask.java:209)

at org.apache.tools.ant.Task.perform(Task.java:364)

at com.niku.tools.taskdefs.ChooseTask.execute(ChooseTask.java:132)

at org.apache.tools.ant.UnknownElement.execute(UnknownElement.java:275)

at org.apache.tools.ant.Task.perform(Task.java:364)

at org.apache.tools.ant.Target.execute(Target.java:342)

at org.apache.tools.ant.Target.performTasks(Target.java:370)

at org.apache.tools.ant.Project.executeSortedTargets(Project.java:1216)

at org.apache.tools.ant.helper.SingleCheckExecutor.executeTargets(SingleCheckExecutor.java:37)

at org.apache.tools.ant.Project.executeTargets(Project.java:1068)

at org.apache.tools.ant.taskdefs.Ant.execute(Ant.java:382)

at org.apache.tools.ant.UnknownElement.execute(UnknownElement.java:275)

at org.apache.tools.ant.Task.perform(Task.java:364)

at org.apache.tools.ant.Target.execute(Target.java:342)

at org.apache.tools.ant.Target.performTasks(Target.java:370)

at org.apache.tools.ant.Project.executeSortedTargets(Project.java:1216)

at org.apache.tools.ant.helper.SingleCheckExecutor.executeTargets(SingleCheckExecutor.java:37)

at org.apache.tools.ant.Project.executeTargets(Project.java:1068)

at org.apache.tools.ant.taskdefs.Ant.execute(Ant.java:382)

at org.apache.tools.ant.taskdefs.CallTarget.execute(CallTarget.java:107)

at com.niku.tools.taskdefs.IfTask.execute(IfTask.java:209)

at org.apache.tools.ant.Task.perform(Task.java:364)

at com.niku.tools.taskdefs.ChooseTask.execute(ChooseTask.java:132)

at org.apache.tools.ant.UnknownElement.execute(UnknownElement.java:275)

at org.apache.tools.ant.Task.perform(Task.java:364)

at com.niku.tools.taskdefs.IfTask.execute(IfTask.java:204)

at org.apache.tools.ant.Task.perform(Task.java:364)

at com.niku.tools.taskdefs.ChooseTask.execute(ChooseTask.java:132)

at org.apache.tools.ant.UnknownElement.execute(UnknownElement.java:275)

at org.apache.tools.ant.Task.perform(Task.java:364)

at org.apache.tools.ant.Target.execute(Target.java:342)

at org.apache.tools.ant.Target.performTasks(Target.java:370)

at org.apache.tools.ant.Project.executeSortedTargets(Project.java:1216)

at org.apache.tools.ant.Project.executeTarget(Project.java:1185)

at org.apache.tools.ant.helper.DefaultExecutor.executeTargets(DefaultExecutor.java:40)

at org.apache.tools.ant.Project.executeTargets(Project.java:1068)

at org.apache.tools.ant.Main.runBuild(Main.java:675)

at org.apache.tools.ant.Main.startAnt(Main.java:190)

at org.apache.tools.ant.launch.Launcher.run(Launcher.java:246)

at org.apache.tools.ant.launch.Launcher.main(Launcher.java:67)
Any help is greatly appreciated
Slovak

Outcomes