AnsweredAssumed Answered

Jaspersoft Server 5.6.1 Installation error

Question asked by PruthviLanke on Sep 2, 2015
Latest reply on Sep 14, 2015 by Nika_Hadzhikidi
Branched to a new discussion


Hi

 

Steps followed during installation:-

 

1. Installed Java JDK 1.7.0_67, JAVA_HOME variable is set and with the PATH environment variable contains the JAVA_HOME\bin location.

2. Copied Tomcat folder to local drive and ensured Tomcat is not running before the installation starts.

3. I have the DWH Database ready.

4. Now, I ran the install.bat using run as administrator with the following inputs below :-

    

App Server Location                  = D:\apache-tomcat-7.0.55

Database Type                             = Oracle

Database Hostname                    = claritt2.db.XXXXXXX.net

Database Port                            = 1521

Jaspersoft Database Username    = PPM_JASPERSOFT

Jaspersoft web app Name              = reportservice

Jaspersoft Install Mode              = standalone

 

and getting the following errors in sequence:-

1.

---------------------------------------------------------------------------------------------------------------------------------------------------

[advanced-sql] 0 rows affected

[advanced-sql] Executing resource: C:\JS_Server\buildomatic\install_resources\sql\oracle\quartz.ddl

[advanced-sql] Failed to execute:   create sequence hibernate_sequence

[advanced-sql] java.sql.SQLSyntaxErrorException: ORA-00955: the name is already used by an existing object

---------------------------------------------------------------------------------------------------------------------------------------------------

2.

--------------------------------------------------------------------------------------------

     [java] Resource name: applicationContext-virtual-data-source.xml

     [java] Error starting heartbeat. Error was: error setting options

    [java] java.net.SocketException: error setting options

     [java]  at java.net.TwoStacksPlainDatagramSocketImpl.join(Native Method)

-------------------------------------------------------------------------------------------

3.

------------------------------------------------------------------------------------------

 

BUILD FAILED

C:\JS_Server\buildomatic\bin\import-export.xml:285: The following error occurred while executing this line:

C:\JS_Server\buildomatic\bin\import-export.xml:158: Java returned: -1

----------------------------------------------------------------------------------------------

 

Log file attached for more detailed errors

 

Could you please suggest the soloution ASAP. Thanks in advance for help.

 

Thanks & regards,

Pruthvi

 

 

 

 

 

Attachments

Outcomes