AnsweredAssumed Answered

Problems with Service Pack 1

Question asked by davidesky on Jul 10, 2012
Latest reply on Sep 3, 2013 by supriya.chakraborty
Good Morning,

We have installed the Service Pack 1 for the 13 Clarity Version,but after the installation we have a problem with the project object; when we try to open an existing project or try to create a new one an Error 500 occurs.
I show you the log file, maybe someone can help us..

Thanks and Best Regards

ERROR 2012-07-10 09:33:41,533 [http-80-6] odf.view (clarity:admin:5321238__C5697CBD-B85E-4D6C-9BD9-08ABD635B9C3:projmgr.projectProperties) Exception occurred loading property view for view locator view: object:project component:projmgr
ERROR 2012-07-10 09:33:41,533 [http-80-6] web.WebActionController (clarity:admin:5321238__C5697CBD-B85E-4D6C-9BD9-08ABD635B9C3:projmgr.projectProperties)
com.niku.union.web.WebException: Service call failed for portlet: projmgr.projectPropertiesTOC
at com.niku.union.web.PortletController.processAuthorizedPortlet(PortletController.java:906)
at com.niku.union.web.PortletController.processPageActionRequest(PortletController.java:394)
at com.niku.union.web.PortletController.processRequest(PortletController.java:163)
at com.niku.union.web.WebActionController.processAction(WebActionController.java:1124)
at com.niku.union.web.WebActionController.processRequest(WebActionController.java:163)
at com.ca.clarity.uif.service.vxml.VXMLService.processRequest(VXMLService.java:403)
at com.ca.clarity.uif.UIServlet.service(UIServlet.java:66)
at javax.servlet.http.HttpServlet.service(HttpServlet.java:717)
at org.apache.catalina.core.ApplicationFilterChain.internalDoFilter(ApplicationFilterChain.java:290)
at org.apache.catalina.core.ApplicationFilterChain.doFilter(ApplicationFilterChain.java:206)
at com.niku.union.web.filter.GZIPResponseFilter.doFilter(GZIPResponseFilter.java:130)
at org.apache.catalina.core.ApplicationFilterChain.internalDoFilter(ApplicationFilterChain.java:235)
at org.apache.catalina.core.ApplicationFilterChain.doFilter(ApplicationFilterChain.java:206)
at com.niku.union.web.filter.CharsetFilter.doFilter(CharsetFilter.java:56)
at org.apache.catalina.core.ApplicationFilterChain.internalDoFilter(ApplicationFilterChain.java:235)
at org.apache.catalina.core.ApplicationFilterChain.doFilter(ApplicationFilterChain.java:206)
at org.apache.catalina.core.StandardWrapperValve.invoke(StandardWrapperValve.java:233)
at org.apache.catalina.core.StandardContextValve.invoke(StandardContextValve.java:191)
at org.apache.catalina.core.StandardHostValve.invoke(StandardHostValve.java:127)
at org.apache.catalina.valves.ErrorReportValve.invoke(ErrorReportValve.java:102)
at org.apache.catalina.valves.AccessLogValve.invoke(AccessLogValve.java:615)
at org.apache.catalina.core.StandardEngineValve.invoke(StandardEngineValve.java:109)
at org.apache.catalina.connector.CoyoteAdapter.service(CoyoteAdapter.java:293)
at org.apache.coyote.http11.Http11Processor.process(Http11Processor.java:859)
at org.apache.coyote.http11.Http11Protocol$Http11ConnectionHandler.process(Http11Protocol.java:602)
at org.apache.tomcat.util.net.JIoEndpoint$Worker.run(JIoEndpoint.java:489)
at java.lang.Thread.run(Thread.java:662)
Caused by: com.niku.union.web.WebException: WebServiceAdapter::processRequest -> failed to process service request
at com.niku.union.web.WebServiceAdapter.processRequest(WebServiceAdapter.java:198)
at com.niku.union.web.PortletController.processServiceRequest(PortletController.java:1393)
at com.niku.union.web.PortletController.processAuthorizedPortlet(PortletController.java:876)
... 26 more
Caused by: com.niku.union.service.ServiceException: Service Exception
at com.niku.odf.service.ODFActionService.processRequest(ODFActionService.java:125)
at com.niku.union.service.binding.ServiceControlBindingJava.processRequest(ServiceControlBindingJava.java:58)
at com.niku.union.service.ServiceControlImpl.processRequest(ServiceControlImpl.java:749)
at com.niku.union.service.ServiceControlImpl.processRequest(ServiceControlImpl.java:211)
at com.niku.union.web.WebServiceAdapter.processRequest(WebServiceAdapter.java:194)
... 28 more
Caused by: com.niku.union.odf.exception.ODFException: Exception occurred loading property view for view locator view: object:project component:projmgr
at com.niku.odf.service.view.ViewLocatorService.locateViews(ViewLocatorService.java:432)
at com.niku.odf.service.view.ViewLocatorService.execute(ViewLocatorService.java:290)
at com.niku.odf.service.object.InstanceSubPageService.doProcess(InstanceSubPageService.java:36)
at com.niku.odf.service.object.CustomObjectTOCService.doProcess(CustomObjectTOCService.java:41)
at com.niku.projmgr.service.portlets.ProjectPropertiesTOC.doProcess(ProjectPropertiesTOC.java:86)
at com.niku.odf.service.ODFActionService.processRequest(ODFActionService.java:86)
... 32 more
Caused by: com.niku.union.odf.exception.ODFException: Unable to evaluate display condition for code:projectCreate.subObjList.status_report
at com.niku.odf.view.property.PropertyViewLoader.locateDisplayableViews(PropertyViewLoader.java:3307)
at com.niku.odf.service.view.ViewLocatorService.locateViews(ViewLocatorService.java:343)
... 37 more
Caused by: org.nfunk.jep.ParseException: Syntax Error (implicit multiplication not enabled)

at com.niku.odf.exprbuilder.ExpressionEvaluator.evaluateExpression(ExpressionEvaluator.java:419)
at com.niku.odf.exprbuilder.ExpressionEvaluator.evaluate(ExpressionEvaluator.java:155)
at com.niku.odf.view.property.PropertyViewLoader.locateDisplayableViews(PropertyViewLoader.java:3298)
... 38 more
ERROR 2012-07-10 09:33:41,549 [http-80-6] performance.PerformanceMonitor (clarity:admin:5321238__C5697CBD-B85E-4D6C-9BD9-08ABD635B9C3:projmgr.projectProperties) Mismatch in timing element stack, where titles do not match ('webRequest' != 'action') or ids do not match ('projmgr.projectProperties' != 'projmgr.projectProperties')

Outcomes